{"text_format":"1","workbook":"xlsx","n_sheets":25,"sheets":["JSONBuvette","Buvette","Param","Note explicative fichier","Eq Chrono","SurvG8","Poissy Entrée","Poissy Sortie","Ponton 1-4","Ponton D-A","Equipes","Detail Equipes","TEMPS-ponton","TEMPS-poissy","penalités","Heures Pass","Temps Pass","Temps corr","Ecart Record","CL mi parcours","Cl Catégories","CL GENERAL","Cl Slalom","Temps départ","Recompenses"],"not_rendered":{"charts":0,"images":0,"macros":1,"external_links":2,"defined_names":83,"comments":5,"pivot_tables":0},"unopened":[],"bounds":{"document_bytes":16777216,"sheet_cells":100000,"rows_first":2000,"rows_last":500,"rows_between":2000,"halvings":0,"cell_chars":16384,"cell_head_chars":4096},"cells_cut":0,"cells_raw":0,"read":"whole","date_system":"1904"}

{"sheet":"JSONBuvette","index":0,"n_rows":37,"n_cols":1,"rows_kept":37,"cut":false,"hidden":true,"merged":[]}
[{"$f":"+Buvette!X3","v":"{\"title\":\"Boissons Chaudes\",\"logo\":\"Boisson1.png\"},"}]
[{"$f":"+Buvette!X4","v":"{\"prod\":\"The\",\"price\":\"1,00\",\"logo\":\"\"},"}]
[{"$f":"+Buvette!X5","v":"{\"prod\":\"Cafe\",\"price\":\"1,00\",\"logo\":\"\"},"}]
[{"$f":"+Buvette!X6","v":"{\"prod\":\"_\",\"price\":\"0,00\",\"logo\":\"\"}"}]
[{"$f":"+Buvette!X7","v":""}]
[{"$f":"+Buvette!X8","v":"---"}]
[{"$f":"+Buvette!X9","v":""}]
[{"$f":"+Buvette!X10","v":"{\"title\":\"Rafraichissements\",\"logo\":\"biere.png\"},"}]
[{"$f":"+Buvette!X11","v":"{\"prod\":\"Mini Maid\",\"price\":\"1,50\",\"logo\":\"\"},"}]
[{"$f":"+Buvette!X12","v":"{\"prod\":\"COCA COLA\",\"price\":\"1,50\",\"logo\":\"\"},"}]
[{"$f":"+Buvette!X13","v":"{\"prod\":\"HEINEKEN\",\"price\":\"1,50\",\"logo\":\"\"},"}]
[{"$f":"+Buvette!X14","v":"{\"prod\":\"Evian\",\"price\":\"3,00\",\"logo\":\"\"},"}]
[{"$f":"+Buvette!X15","v":"{\"prod\":\"Badoit\",\"price\":\"0,50\",\"logo\":\"\"},"}]
[{"$f":"+Buvette!X16","v":"{\"prod\":\"Coca Cola\",\"price\":\"0,50\",\"logo\":\"\"},"}]
[{"$f":"+Buvette!X17","v":"{\"prod\":\"_\",\"price\":\"0,00\",\"logo\":\"\"},"}]
[{"$f":"+Buvette!X18","v":"{\"prod\":\"Verre de Vin\",\"price\":\"1,50\",\"logo\":\"\"},"}]
[{"$f":"+Buvette!X19","v":"{\"prod\":\"_\",\"price\":\"0,00\",\"logo\":\"\"},"}]
[{"$f":"+Buvette!X20","v":"{\"prod\":\"_\",\"price\":\"0,00\",\"logo\":\"\"},"}]
[{"$f":"+Buvette!X21","v":"{\"prod\":\"_\",\"price\":\"_\",\"logo\":\"\"}"}]
[{"$f":"+Buvette!X22","v":""}]
[{"$f":"+Buvette!X23","v":"---"}]
[{"$f":"+Buvette!X24","v":""}]
[{"$f":"+Buvette!X25","v":"{\"title\":\"Desserts\",\"logo\":\"glaces.jpg\"},"}]
[{"$f":"+Buvette!X26","v":"{\"prod\":\"Patisseries\",\"price\":\"1,50\",\"logo\":\"\"},"}]
[{"$f":"+Buvette!X27","v":"{\"prod\":\"Flans\",\"price\":\"_\",\"logo\":\"\"},"}]
[{"$f":"+Buvette!X28","v":"{\"prod\":\"Mister Freeze\",\"price\":\"_\",\"logo\":\"\"},"}]
[{"$f":"+Buvette!X29","v":"{\"prod\":\"-\",\"price\":\"_\",\"logo\":\"\"}"}]
[{"$f":"+Buvette!X30","v":""}]
[{"$f":"+Buvette!X31","v":"---"}]
[{"$f":"+Buvette!X32","v":""}]
[{"$f":"+Buvette!X33","v":"{\"title\":\"Encas\",\"logo\":\"sandwitchs.png\"},"}]
[{"$f":"+Buvette!X34","v":"{\"prod\":\"2 saucisses Frites\",\"price\":\"3,50\",\"logo\":\"\"},"}]
[{"$f":"+Buvette!X35","v":"{\"prod\":\"Cornet de Frites\",\"price\":\"2,00\",\"logo\":\"\"},"}]
[{"$f":"+Buvette!X36","v":"{\"prod\":\"Sandwitch Mergez\",\"price\":\"3,00\",\"logo\":\"\"},"}]
[{"$f":"+Buvette!X37","v":"{\"prod\":\"Sandwitch Saucisse\",\"price\":\"2,00\",\"logo\":\"\"}"}]
[{"$f":"+Buvette!X38","v":""}]
[{"$f":"+Buvette!X39","v":""}]

{"sheet":"Buvette","index":1,"n_rows":39,"n_cols":28,"rows_kept":39,"cut":false,"hidden":true,"merged":[[2,5,2,7],[2,1,2,3],[2,9,2,11],[2,13,2,15],[0,25,0,27]]}
["BUVETTE",null,null,null,null,null,null,null,null,null,null,null,null,null,null,null,null,null,null,null,null,null,null,"Script JSON",null,"Parametres"]
["Enregistré",null,null,null,null,null,null,null,null,null,null,null,null,null,null,null,null,null,null,null,null,null,null,null,null,"\"title\":","Row0","Boisson1.png"]
[null,"Boissons Chaudes",null,null,null,"Rafraichissements",null,null,null,"Desserts",null,null,null,"Encas",null,null,null,null,null,"Boisson1.png",{"$f":"IF(T3=\"\",\"\",T3)","v":"Boisson1.png"},null,null,{"$f":"CHAR(123)&TEXT($Z$2,\"0,00\")&CHAR(34)&TEXT($B3,\"0,00\")&CHAR(34)&CHAR(44)&TEXT($Z$5,\"0,00\")&CHAR(34)&TEXT(U3,\"x\")&CHAR(34)&CHAR(125)&CHAR(44)","v":"{\"title\":\"Boissons Chaudes\",\"logo\":\"Boisson1.png\"},"},null,"\"prod\":","Row1","biere.png"]
[null,null,"The",1,null,null,"Mini Maid",1.5,null,null,"Patisseries",1.5,null,null,"2 saucisses Frites",3.5,null,null,null,null,{"$f":"IF(T4=\"\",\"\",T4)","v":""},{"$f":"+IF(C5=\"\",\"\",\",\")","v":","},null,{"$f":"CHAR(123)&TEXT($Z$3,\"0,00\")&CHAR(34)&TEXT($C4,\"0,00\")&CHAR(34)&CHAR(44)&TEXT($Z$4,\"0,00\")&CHAR(34)&TEXT(D4,\"0,00\")&CHAR(34)&CHAR(44)&TEXT($Z$5,\"0,00\")&CHAR(34)&TEXT(U4,\"x\")&CHAR(34)&CHAR(125)&TEXT(V4,\"0,00\")","v":"{\"prod\":\"The\",\"price\":\"1,00\",\"logo\":\"\"},"},null,"\"price\":",null,"sandwitchs.png"]
[null,null,"Cafe",1,null,null,"COCA COLA",1.5,null,null,"Flans","_",null,null,"Cornet de Frites",2,null,null,null,null,{"$f":"IF(T5=\"\",\"\",T5)","v":""},{"$f":"+IF(C6=\"\",\"\",\",\")","v":","},null,{"$f":"CHAR(123)&TEXT($Z$3,\"0,00\")&CHAR(34)&TEXT($C5,\"0,00\")&CHAR(34)&CHAR(44)&TEXT($Z$4,\"0,00\")&CHAR(34)&TEXT(D5,\"0,00\")&CHAR(34)&CHAR(44)&TEXT($Z$5,\"0,00\")&CHAR(34)&TEXT(U5,\"x\")&CHAR(34)&CHAR(125)&TEXT(V5,\"0,00\")","v":"{\"prod\":\"Cafe\",\"price\":\"1,00\",\"logo\":\"\"},"},null,"\"logo\":",null,"glaces.jpg"]
[null,null,"_",null,null,null,"HEINEKEN",1.5,null,null,"Mister Freeze","_",null,null,"Sandwitch Mergez",3,null,null,null,null,{"$f":"IF(T6=\"\",\"\",T6)","v":""},{"$f":"+IF(C7=\"\",\"\",\",\")","v":""},null,{"$f":"CHAR(123)&TEXT($Z$3,\"0,00\")&CHAR(34)&TEXT($C6,\"0,00\")&CHAR(34)&CHAR(44)&TEXT($Z$4,\"0,00\")&CHAR(34)&TEXT(D6,\"0,00\")&CHAR(34)&CHAR(44)&TEXT($Z$5,\"0,00\")&CHAR(34)&TEXT(U6,\"x\")&CHAR(34)&CHAR(125)&TEXT(V6,\"0,00\")","v":"{\"prod\":\"_\",\"price\":\"0,00\",\"logo\":\"\"}"},null,null,null,"cookies.png"]
[null,null,null,null,null,null,"Evian",3,null,null,"-","_",null,null,"Sandwitch Saucisse",2,null,null,null,null,null,null,null,{"$f":"IF(C7=\"\",\"\")","v":""}]
[null,"---",null,null,null,null,"Badoit",0.5,null,null,null,null,null,null,null,null,null,null,null,null,null,null,null,"---"]
[null,null,null,null,null,null,"Coca Cola",0.5,null,{"$f":"+F16","v":"---"},null,null,null,null,null,null,null,null,null,null,null,null,null,{"$f":"IF(C9=\"\",\"\")","v":""}]
[null,null,null,null,null,null,"_",null,null,null,null,null,null,null,null,null,null,null,null,"biere.png",{"$f":"IF(T10=\"\",\"\",T10)","v":"biere.png"},null,null,{"$f":"CHAR(123)&TEXT($Z$2,\"0,00\")&CHAR(34)&TEXT($F3,\"0,00\")&CHAR(34)&CHAR(44)&TEXT($Z$5,\"0,00\")&CHAR(34)&TEXT(U10,\"x\")&CHAR(34)&CHAR(125)&CHAR(44)","v":"{\"title\":\"Rafraichissements\",\"logo\":\"biere.png\"},"}]
[null,null,null,null,null,null,"Verre de Vin",1.5,null,null,null,null,null,null,null,null,null,null,null,null,{"$f":"IF(T11=\"\",\"\",T11)","v":""},{"$f":"+IF(G5=\"\",\"\",\",\")","v":","},null,{"$f":"CHAR(123)&TEXT($Z$3,\"0,00\")&CHAR(34)&TEXT($G4,\"0,00\")&CHAR(34)&CHAR(44)&TEXT($Z$4,\"0,00\")&CHAR(34)&TEXT(H4,\"0,00\")&CHAR(34)&CHAR(44)&TEXT($Z$5,\"0,00\")&CHAR(34)&TEXT(U11,\"x\")&CHAR(34)&CHAR(125)&TEXT(V11,\"0,00\")","v":"{\"prod\":\"Mini Maid\",\"price\":\"1,50\",\"logo\":\"\"},"}]
[null,null,null,null,null,null,"_",null,null,null,null,null,null,null,null,null,null,null,null,null,{"$f":"IF(T12=\"\",\"\",T12)","v":""},",",null,{"$f":"CHAR(123)&TEXT($Z$3,\"0,00\")&CHAR(34)&TEXT($G5,\"0,00\")&CHAR(34)&CHAR(44)&TEXT($Z$4,\"0,00\")&CHAR(34)&TEXT(H5,\"0,00\")&CHAR(34)&CHAR(44)&TEXT($Z$5,\"0,00\")&CHAR(34)&TEXT(U12,\"x\")&CHAR(34)&CHAR(125)&TEXT(V12,\"0,00\")","v":"{\"prod\":\"COCA COLA\",\"price\":\"1,50\",\"logo\":\"\"},"}]
[null,null,null,null,null,null,"_",null,null,null,null,null,null,null,null,null,null,null,null,null,"",",",null,"{\"prod\":\"HEINEKEN\",\"price\":\"1,50\",\"logo\":\"\"},"]
[null,null,null,null,null,null,"_","_",null,null,null,null,null,null,null,null,null,null,null,null,"",",",null,"{\"prod\":\"Evian\",\"price\":\"3,00\",\"logo\":\"\"},"]
[null,null,null,null,null,null,null,null,null,null,null,null,null,null,null,null,null,null,null,null,"",",",null,"{\"prod\":\"Badoit\",\"price\":\"0,50\",\"logo\":\"\"},"]
[null,null,null,null,null,{"$f":"+B8","v":"---"},null,null,null,null,null,null,null,null,null,null,null,null,null,null,"",",",null,"{\"prod\":\"Coca Cola\",\"price\":\"0,50\",\"logo\":\"\"},"]
[null,null,null,null,null,null,null,null,null,null,null,null,null,null,null,null,null,null,null,null,"",",",null,"{\"prod\":\"_\",\"price\":\"0,00\",\"logo\":\"\"},"]
[null,null,null,null,null,null,null,null,null,null,null,null,null,null,null,null,null,null,null,null,"",",",null,"{\"prod\":\"Verre de Vin\",\"price\":\"1,50\",\"logo\":\"\"},"]
[null,null,null,null,null,null,null,null,null,null,null,null,null,null,null,null,null,null,null,null,"",",",null,"{\"prod\":\"_\",\"price\":\"0,00\",\"logo\":\"\"},"]
[null,null,null,null,null,null,null,null,null,null,null,null,null,null,null,null,null,null,null,null,"",",",null,"{\"prod\":\"_\",\"price\":\"0,00\",\"logo\":\"\"},"]
[null,null,null,null,null,null,null,null,null,null,null,null,null,null,null,null,null,null,null,null,"","",null,{"$f":"CHAR(123)&TEXT($Z$3,\"0,00\")&CHAR(34)&TEXT($G14,\"0,00\")&CHAR(34)&CHAR(44)&TEXT($Z$4,\"0,00\")&CHAR(34)&TEXT(H14,\"0,00\")&CHAR(34)&CHAR(44)&TEXT($Z$5,\"0,00\")&CHAR(34)&TEXT(U21,\"x\")&CHAR(34)&CHAR(125)&TEXT(V21,\"0,00\")","v":"{\"prod\":\"_\",\"price\":\"_\",\"logo\":\"\"}"}]
[null,null,null,null,null,null,null,null,null,null,null,null,null,null,null,null,null,null,null,null,null,null,null,{"$f":"IF(G15=\"\",\"\")","v":""}]
[null,null,null,null,null,null,null,null,null,null,null,null,null,null,null,null,null,null,null,null,null,null,null,{"$f":"+F16","v":"---"}]
[null,null,null,null,null,null,null,null,null,null,null,null,null,null,null,null,null,null,null,null,null,null,null,{"$f":"IF(C24=\"\",\"\")","v":""}]
[null,null,null,null,null,null,null,null,null,null,null,null,null,null,null,null,null,null,null,"glaces.jpg",{"$f":"IF(T25=\"\",\"\",T25)","v":"glaces.jpg"},null,null,{"$f":"CHAR(123)&TEXT($Z$2,\"0,00\")&CHAR(34)&TEXT($J3,\"0,00\")&CHAR(34)&CHAR(44)&TEXT($Z$5,\"0,00\")&CHAR(34)&TEXT(U25,\"x\")&CHAR(34)&CHAR(125)&CHAR(44)","v":"{\"title\":\"Desserts\",\"logo\":\"glaces.jpg\"},"}]
[null,null,null,null,null,null,null,null,null,null,null,null,null,null,null,null,null,null,null,null,{"$f":"IF(T26=\"\",\"\",T26)","v":""},{"$f":"+IF(K5=\"\",\"\",\",\")","v":","},null,{"$f":"CHAR(123)&TEXT($Z$3,\"0,00\")&CHAR(34)&TEXT($K4,\"0,00\")&CHAR(34)&CHAR(44)&TEXT($Z$4,\"0,00\")&CHAR(34)&TEXT(L4,\"0,00\")&CHAR(34)&CHAR(44)&TEXT($Z$5,\"0,00\")&CHAR(34)&TEXT(U26,\"x\")&CHAR(34)&CHAR(125)&TEXT(V26,\"0,00\")","v":"{\"prod\":\"Patisseries\",\"price\":\"1,50\",\"logo\":\"\"},"}]
[null,null,null,null,null,null,null,null,null,null,null,null,null,null,null,null,null,null,null,null,{"$f":"IF(T27=\"\",\"\",T27)","v":""},{"$f":"+IF(K6=\"\",\"\",\",\")","v":","},null,{"$f":"CHAR(123)&TEXT($Z$3,\"0,00\")&CHAR(34)&TEXT($K5,\"0,00\")&CHAR(34)&CHAR(44)&TEXT($Z$4,\"0,00\")&CHAR(34)&TEXT(L5,\"0,00\")&CHAR(34)&CHAR(44)&TEXT($Z$5,\"0,00\")&CHAR(34)&TEXT(U27,\"x\")&CHAR(34)&CHAR(125)&TEXT(V27,\"0,00\")","v":"{\"prod\":\"Flans\",\"price\":\"_\",\"logo\":\"\"},"}]
[null,null,null,null,null,null,null,null,null,null,null,null,null,null,null,null,null,null,null,null,{"$f":"IF(T28=\"\",\"\",T28)","v":""},{"$f":"+IF(K7=\"\",\"\",\",\")","v":","},null,{"$f":"CHAR(123)&TEXT($Z$3,\"0,00\")&CHAR(34)&TEXT($K6,\"0,00\")&CHAR(34)&CHAR(44)&TEXT($Z$4,\"0,00\")&CHAR(34)&TEXT(L6,\"0,00\")&CHAR(34)&CHAR(44)&TEXT($Z$5,\"0,00\")&CHAR(34)&TEXT(U28,\"x\")&CHAR(34)&CHAR(125)&TEXT(V28,\"0,00\")","v":"{\"prod\":\"Mister Freeze\",\"price\":\"_\",\"logo\":\"\"},"}]
[null,null,null,null,null,null,null,null,null,null,null,null,null,null,null,null,null,null,null,null,{"$f":"IF(T29=\"\",\"\",T29)","v":""},{"$f":"+IF(K8=\"\",\"\",\",\")","v":""},null,{"$f":"CHAR(123)&TEXT($Z$3,\"0,00\")&CHAR(34)&TEXT($K7,\"0,00\")&CHAR(34)&CHAR(44)&TEXT($Z$4,\"0,00\")&CHAR(34)&TEXT(L7,\"0,00\")&CHAR(34)&CHAR(44)&TEXT($Z$5,\"0,00\")&CHAR(34)&TEXT(U29,\"x\")&CHAR(34)&CHAR(125)&TEXT(V29,\"0,00\")","v":"{\"prod\":\"-\",\"price\":\"_\",\"logo\":\"\"}"}]
[null,null,null,null,null,null,null,null,null,null,null,null,null,null,null,null,null,null,null,null,null,null,null,{"$f":"IF(K8=\"\",\"\")","v":""}]
[null,null,null,null,null,null,null,null,null,null,null,null,null,null,null,null,null,null,null,null,null,null,null,{"$f":"+J9","v":"---"}]
[null,null,null,null,null,null,null,null,null,null,null,null,null,null,null,null,null,null,null,null,null,null,null,{"$f":"IF(C32=\"\",\"\")","v":""}]
[null,null,null,null,null,null,null,null,null,null,null,null,null,null,null,null,null,null,null,"sandwitchs.png",{"$f":"IF(T33=\"\",\"\",T33)","v":"sandwitchs.png"},null,null,{"$f":"CHAR(123)&TEXT($Z$2,\"0,00\")&CHAR(34)&TEXT($N3,\"0,00\")&CHAR(34)&CHAR(44)&TEXT($Z$5,\"0,00\")&CHAR(34)&TEXT(U33,\"x\")&CHAR(34)&CHAR(125)&CHAR(44)","v":"{\"title\":\"Encas\",\"logo\":\"sandwitchs.png\"},"}]
[null,null,null,null,null,null,null,null,null,null,null,null,null,null,null,null,null,null,null,null,{"$f":"IF(T34=\"\",\"\",T34)","v":""},{"$f":"+IF(O5=\"\",\"\",\",\")","v":","},null,{"$f":"CHAR(123)&TEXT($Z$3,\"0,00\")&CHAR(34)&TEXT($O4,\"0,00\")&CHAR(34)&CHAR(44)&TEXT($Z$4,\"0,00\")&CHAR(34)&TEXT(P4,\"0,00\")&CHAR(34)&CHAR(44)&TEXT($Z$5,\"0,00\")&CHAR(34)&TEXT(U34,\"x\")&CHAR(34)&CHAR(125)&TEXT(V34,\"0,00\")","v":"{\"prod\":\"2 saucisses Frites\",\"price\":\"3,50\",\"logo\":\"\"},"}]
[null,null,null,null,null,null,null,null,null,null,null,null,null,null,null,null,null,null,null,null,{"$f":"IF(T35=\"\",\"\",T35)","v":""},{"$f":"+IF(O6=\"\",\"\",\",\")","v":","},null,{"$f":"CHAR(123)&TEXT($Z$3,\"0,00\")&CHAR(34)&TEXT($O5,\"0,00\")&CHAR(34)&CHAR(44)&TEXT($Z$4,\"0,00\")&CHAR(34)&TEXT(P5,\"0,00\")&CHAR(34)&CHAR(44)&TEXT($Z$5,\"0,00\")&CHAR(34)&TEXT(U35,\"x\")&CHAR(34)&CHAR(125)&TEXT(V35,\"0,00\")","v":"{\"prod\":\"Cornet de Frites\",\"price\":\"2,00\",\"logo\":\"\"},"}]
[null,null,null,null,null,null,null,null,null,null,null,null,null,null,null,null,null,null,null,null,{"$f":"IF(T36=\"\",\"\",T36)","v":""},{"$f":"+IF(O7=\"\",\"\",\",\")","v":","},null,{"$f":"CHAR(123)&TEXT($Z$3,\"0,00\")&CHAR(34)&TEXT($O6,\"0,00\")&CHAR(34)&CHAR(44)&TEXT($Z$4,\"0,00\")&CHAR(34)&TEXT(P6,\"0,00\")&CHAR(34)&CHAR(44)&TEXT($Z$5,\"0,00\")&CHAR(34)&TEXT(U36,\"x\")&CHAR(34)&CHAR(125)&TEXT(V36,\"0,00\")","v":"{\"prod\":\"Sandwitch Mergez\",\"price\":\"3,00\",\"logo\":\"\"},"}]
[null,null,null,null,null,null,null,null,null,null,null,null,null,null,null,null,null,null,null,null,{"$f":"IF(T37=\"\",\"\",T37)","v":""},{"$f":"+IF(C38=\"\",\"\",\",\")","v":""},null,{"$f":"CHAR(123)&TEXT($Z$3,\"0,00\")&CHAR(34)&TEXT($O7,\"0,00\")&CHAR(34)&CHAR(44)&TEXT($Z$4,\"0,00\")&CHAR(34)&TEXT(P7,\"0,00\")&CHAR(34)&CHAR(44)&TEXT($Z$5,\"0,00\")&CHAR(34)&TEXT(U37,\"x\")&CHAR(34)&CHAR(125)&TEXT(V37,\"0,00\")","v":"{\"prod\":\"Sandwitch Saucisse\",\"price\":\"2,00\",\"logo\":\"\"}"}]
[null,null,null,null,null,null,null,null,null,null,null,null,null,null,null,null,null,null,null,null,null,null,null,{"$f":"IF(C38=\"\",\"\")","v":""}]
[null,null,null,null,null,null,null,null,null,null,null,null,null,null,null,null,null,null,null,null,null,null,null,{"$f":"IF(C39=\"\",\"\")","v":""}]

{"sheet":"Param","index":2,"n_rows":14,"n_cols":13,"rows_kept":14,"cut":false,"hidden":true,"merged":[[2,2,2,7],[4,9,4,11],[13,2,13,7],[9,2,9,7],[10,2,10,7],[8,2,8,7],[3,2,3,7]]}
[null,null,null,null,0,1,2]
[null,"process :","ACVP_",null,{"$f":"+$C$2&E1","v":"ACVP_0"},{"$f":"+$C$2&F1","v":"ACVP_1"},{"$f":"+$C$2&G1","v":"ACVP_2"}]
[null,"Path:","D:\\00 ACVP\\IPMS\\TV_Program\\"]
[null,"File_Transfer >","B:\\ACVP\\IPMS\\JSON\\"]
[null,"CSV Files:","ACVP_G8",null,{"$f":"+C5&\"_0_\"","v":"ACVP_G8_0_"},{"$f":"+C5&\"_1_\"","v":"ACVP_G8_1_"},{"$f":"+C5&\"_2_\"","v":"ACVP_G8_2_"},"Arbitrage",null,{"$f":"+NOW()","v":"2024-06-03T16:50:54.740"},null,null,{"$f":"+MID(CELL(\"nomfichier\"), FIND(\"[\", CELL(\"nomfichier\"))+1,FIND(\"]\", CELL(\"nomfichier\"))- FIND(\"[\", CELL(\"nomfichier\"))-1)","v":"ACVP_G8_2024.xlsm"}]
[null,"File:",null,null,{"$f":"+E5&J7","v":"ACVP_G8_0_20240603"},{"$f":"+F5&J7","v":"ACVP_G8_1_20240603"},{"$f":"+G5&J7","v":"ACVP_G8_2_20240603"},{"$f":"+H5&H7","v":"Arbitrage.xlsm"},null,{"$f":"+YEAR(J5)","v":2024},{"$f":"+MONTH(J5)","v":6},{"$f":"+DAY(J5)","v":3}]
[null,"ext:",null,null,".json",".json",".json",".xlsm",null,{"$f":"+J6&K7&L7","v":"20240603"},{"$f":"+IF(K6>9,K6,0&K6)","v":"06"},{"$f":"+IF(L6>9,L6,0&L6)","v":"03"}]
[]
[null,"File_Transfer >","D:\\00 ACVP\\IPMS\\JSON\\"]
[null,null,{"$f":"+$C$9&$F$6","v":"D:\\00 ACVP\\IPMS\\JSON\\ACVP_G8_1_20240603"}]
[null,null,{"$f":"+$C$9&$G$6","v":"D:\\00 ACVP\\IPMS\\JSON\\ACVP_G8_2_20240603"}]
[]
[]
[null,"File_Save >",{"$f":"+C3&H5&H7","v":"D:\\00 ACVP\\IPMS\\TV_Program\\Arbitrage.xlsm"}]

{"sheet":"Note explicative fichier","index":3,"n_rows":30,"n_cols":5,"rows_kept":30,"cut":false,"hidden":false,"merged":[[29,0,29,3],[0,0,0,3],[23,2,25,2],[23,3,25,3],[27,0,27,3],[28,0,28,3]]}
["Explications et actions à faire sur le Fichier Arbitrage G8"]
["Onglet:","Actions ","QUAND","Qui","date G8"]
["Note explicative fichier","mise à jour de la date du G8","AVANT LE JOUR du GRAND HUIT","resp arbitrage","2024-06-02"]
["Eq Chrono","Inscrire les coordonnées des arbitres et les règles de la course","DES QUE L'EQUIPE EST CONSTITUEE","resp arbitrage","Anne Clarisse"]
["SurvG8","Les équipes arbitres et les équipes participantes sont mise à jour automatiquement\nà imprimer pour les arbitres et équipiers sécurité sur l'eau ?\nReporter dans les colonnes de E à G les éventuelles pénalités remontées par les équipes de l'arbitrage ou de la sécurité sur l'eau."]
["Poissy Entrée","Fiche à imprimer et à donner aux arbitres postés à l'entrée du slalom. La photo de cette fiche est à envoyer ensuite  à la personne qui complète le tableau Excel des résultats.","AVANT LE DEPART","resp arbitrage"]
["Poissy Sortie","Fiche à imprimer et à donner aux arbitres postés à la sortie du slalom. La photo de cette fiche est à envoyer ensuite  à la personne qui complète le tableau Excel des résultats.","AVANT LE DEPART","resp arbitrage"]
["Ponton ¼","Fiche à imprimer et à donner aux arbitres postés sur le ponton devant le bief. La photo de cette fiche est à envoyer ensuite  à la personne qui complète le tableau Excel des résultats.","AVANT LE DEPART","resp arbitrage"]
["Ponton DA","Fiche à imprimer et à donner aux arbitres postés sur le ponton de départ et d'arrivée. La photo de cette fiche est à envoyer ensuite  à la personne qui complète le tableau Excel des résultats.","AVANT LE DEPART","resp arbitrage"]
["Equipes","NE PAS MODIFIER LA FEUILLE\nA imprimer et à transmettre à Véronique qui appelle et présente les équipes au départ","AVANT LE DEPART","resp arbitrage"]
["Détail Equipes ","Reporter les informations transmises par le.a responsable des inscriptions\n+ mettre en colonne A le N° de tirage au sort attribué à chaque équipage","CLOTURE DES INSCRIPTIONS & AVANT LE DEPART","resp arbitrage"]
["Temps-Ponton","METTRE A JOUR L'INTERVALLE DE TEMPS ENTRE LES DEPARTS DES YOLETTES\nCompléter des temps transmis par les équipes du Ponton ¼ et du Ponton DA","AVANT\nPENDANT","resp arbitrage"]
["Temps-Poissy","Compléter des temps transmis par les équipes du Slalom","PENDANT","resp arbitrage"]
["Pénalités","renseigner les pénalités potentielles remontées par les équipes d'arbitrage, celles de sécurité sur l'eau (Colonnes T à Z)\nLes pénalités enregistrées dans Temps Poissy sont reportées automatiquement","APRES LA COURSE","resp arbitrage"]
["Heures Pass","synthèse des heures de passage \nRien à faire; se complète suivant les données renseignées dans les Temps…"]
["Temps Pass","calcule les temps de passage à Poissy, 1/4, 1/2 et total\nRien à faire, se met à jour automatiquement"]
["Temps corr","Rien à faire - se met à jour automatiquement selon les données saisies dans temps ponton, temps poissy et pénalités"]
["Ecart avec record","ecarts avec le record du G8\nà imprimer ?"]
["CL Mi Parcours","Mis à jour Automatique par la commande Ctrl+Majuscule+M\nà imprimer ","APRES LA COURSE"]
["CL Categories","Mis à jour Automatique par la commande Ctrl+Majuscule+C\nà imprimer ","APRES LA COURSE"]
["CL Général","Mis à jour Automatique par la commande Ctrl+Majuscule+G\nà imprimer ","APRES LA COURSE"]
["CL Slalom","Mis à jour Automatique par la commande Ctrl+Majuscule+S\nà imprimer ","APRES LA COURSE"]
["Temps Départ","Mis à jour Automatique par la commande Ctrl+Majuscule+D\nà imprimer ","APRES LA COURSE"]
["Récompenses","NE RENSEIGNER QUE LE N° DE L'EQUIPAGE POUR LE PRIX DE LA PERSEVERENCE","APRES LA COURSE","le.a Président.e"]
[null,"Renseigner selon les officiels presents ceux qui remettent les coupes"]
[null,"A imprimer pour la remise des prix pour le.a Président.e "]
[]
["Avant d'imprimer, faire une vérification de cohérence des résultats."]
["Imprimer les pages en plusieurs exemplaires (1 à donner à Véronique/Frédéric puis après l'annonce des résultats en afficher sur les portes + qq part à l'extérieur) "]
["faire des pdf de ces résultats pour les mettre en ligne sur le site de l'ACVP  (http://www.aviron-acvp.fr/)"]

{"sheet":"Eq Chrono","index":4,"n_rows":28,"n_cols":11,"rows_kept":28,"cut":false,"hidden":false,"merged":[[0,7,0,10],[11,10,11,11],[5,6,5,7],[6,6,6,7],[8,11,8,12],[5,11,5,12],[6,11,6,12],[11,6,12,6],[7,6,7,7],[7,11,7,12],[2,6,2,7],[27,1,27,2],[27,4,27,5],[27,7,27,9],[23,7,23,9],[16,1,16,5],[16,6,18,6],[17,1,17,5],[18,1,18,5],[21,7,21,10],[23,1,23,2],[23,4,23,5],[13,1,13,5],[14,1,14,5],[15,1,15,5],[4,1,4,2],[10,1,10,6],[11,1,11,5],[12,1,12,5],[13,6,15,6]]}
[null,"CHRONOMETRAGE   GRAND 8   ",null,null,null,null,null,{"$f":"'Note explicative fichier'!E3","v":"2024-06-02"}]
[]
[null,null,null,null,"Liaison Ponton"]
[]
[null,"Ponton Départ, ½, Arrivée",null,null,null,"Ponton ¼, ¾",null,null,null,null,"Slalom Pont de Poissy"]
[]
[]
[]
[]
[]
[null,"Rappel des Pénalités"]
[null,"Refus de se laisser dépasser en zone non étroite",null,null,null,null,"3 min",null,null,null,"Nb par Catégorie"]
[null,"Dépassement ou arrêt en zône dangereuse  et étroite",null,null,null,null,null,null,null,null,{"$f":"+Equipes!O2","v":"M"}]
[null,"Changement de barreur hors zone ",null,null,null,null,"2 min",null,null,null,{"$f":"+Equipes!O3","v":"F"}]
[null,"Slalom incorrect, non respect du parcours imposé",null,null,null,null,null,null,null,null,{"$f":"+Equipes!O4","v":"H"}]
[null,"Refus de priorité au bateau avalant, au bief Villennes / Migneaux",null,null,null,null,null,null,null,null,{"$f":"+Equipes!M5","v":"Total"}]
[null,"Changement de barreur non réalisé à mi-course, face au ponton",null,null,null,null,"5 min"]
[null,"Slalom « raccourci », sans remontée du courant vers Paris "]
[null,"Non respect du balisage sur le grand bras"]
[]
[]
[null,"SECURITE SUR L EAU",null,null,null,null,null,"2024-06-02"]
[]
[null,"Entrée du Port",null,null,"Vieux Pont de Poissy",null,null,"Bief Grand Bras"]
[]
[]
[]
[null,"Bout de l'Ile de Villennes et navette le long de l ile de villennes",null,null,"Navette Ile de Migneaux / Pont de Poissy",null,null,"Pont de Villennes"]

{"sheet":"SurvG8","index":5,"n_rows":54,"n_cols":8,"rows_kept":54,"cut":false,"hidden":false,"merged":[[0,1,0,7],[2,4,2,7],[3,4,3,6],[4,4,4,6],[5,4,5,6],[4,1,5,1],[9,1,12,1],[1,1,1,2],[1,4,1,7],[9,4,9,6],[10,4,10,6],[11,4,12,7],[6,4,6,6],[8,7,10,7],[7,4,7,6],[7,1,8,1],[8,4,8,6],[3,7,4,7],[5,7,7,7]]}
[null,"FEUILLE DE PENALITE"]
[null,"Surveillance du Grand 8 ",null,{"$f":"'Note explicative fichier'!E3","v":"2024-06-02"}," - Nom de l'Arbitre:\n - Numéro du bateau de sécurité :                                                                                        "]
[null,"RDC Base PC",{"$f":"'Eq Chrono'!B3","v":"1904-01-01"},{"$f":"'Eq Chrono'!C3","v":0},"Rappel des Pénalités"]
[null,"Liaison Pontons / PC",{"$f":"'Eq Chrono'!F3","v":"1904-01-01"},null,"Refus de se laisser dépasser en zone non étroite",null,null,"3 min"]
[null,"Ponton                  Départ -1/2 - Arrivée",{"$f":"'Eq Chrono'!B6","v":0},{"$f":"'Eq Chrono'!C6","v":0},"Dépassement ou arrêt en zône dangereuse  et étroite"]
[null,null,{"$f":"'Eq Chrono'!B7","v":0},{"$f":"'Eq Chrono'!C7","v":0},"Changement de barreur hors zone ",null,null,"2 min"]
[null,"Ponton changt barreur",{"$f":"'Eq Chrono'!B8","v":0},{"$f":"'Eq Chrono'!C8","v":0},"Slalom incorrect, non respect du parcours imposé"]
[null,"Ponton 1/4 3/4",{"$f":"'Eq Chrono'!K8","v":0},{"$f":"'Eq Chrono'!G6","v":0},"Refus de priorité au bateau avalant, au bief Villennes / Migneaux"]
[null,null,{"$f":"'Eq Chrono'!F7","v":0},{"$f":"'Eq Chrono'!G7","v":0},"Changement de barreur non réalisé à mi-course, face au ponton",null,null,"5 min"]
[null,"Pont de Poissy",{"$f":"'Eq Chrono'!K6","v":0},{"$f":"'Eq Chrono'!L6","v":0},"Slalom « raccourci », sans remontée du courant vers Paris "]
[null,null,{"$f":"'Eq Chrono'!K7","v":0},{"$f":"'Eq Chrono'!L7","v":0},"Couper les courbes sur la  Seine"]
[null,null,0,0]
[null,null,{"$f":"'Eq Chrono'!K9","v":0},{"$f":"'Eq Chrono'!L9","v":0}]
[null,"Yolette N°","CLUB","EQUIPAGE","PENALITES POUR :","Autre Yolette concernée","Heure Minute","Durée de\nla pénalité"]
[null,{"$f":"'TEMPS-ponton'!A5","v":1},{"$f":"'TEMPS-ponton'!B5","v":"ANDRESY CA CONFLUENT 1"},{"$f":"'TEMPS-ponton'!D5","v":"Stephanie LAPORTE-Marine NACERI-Marc LACCASSAGNE-Stephane ZETTWOOG-Fouzia VOIRIN"}]
[null,{"$f":"'TEMPS-ponton'!A6","v":2},{"$f":"'TEMPS-ponton'!B6","v":"CAUDEBEC EN CAUX ACVS 1"},{"$f":"'TEMPS-ponton'!D6","v":"Martine NARBAIS-JAUREGUY-Caroline KERVRANN-Stephane DELAMARE-Nicolas BARRAY-Francois NARBAIS-JAUREGUY"}]
[null,{"$f":"'TEMPS-ponton'!A7","v":3},{"$f":"'TEMPS-ponton'!B7","v":"ANDRESY CA CONFLUENT 2"},{"$f":"'TEMPS-ponton'!D7","v":"Anna ALCALOIDEPOIXBLANC-Geoffrey GHIZZONI-Nathalie BOURGEOIS-Franck CHRISTIANNOT-NicOLAS delaunoy"}]
[null,{"$f":"'TEMPS-ponton'!A8","v":4},{"$f":"'TEMPS-ponton'!B8","v":"ANDRESY CA CONFLUENT 1"},{"$f":"'TEMPS-ponton'!D8","v":"Emmanuel SALIN-Ousseni PARKOUDA-Jean-Baptiste PROVENZANO-Jerome CLAVE-Julian GALLELA"}]
[null,{"$f":"'TEMPS-ponton'!A9","v":5},{"$f":"'TEMPS-ponton'!B9","v":"PORT-MARLY RC 1"},{"$f":"'TEMPS-ponton'!D9","v":"Claudie BODIN-Fanny LAMOUR-Etienne DUPUIS-Jeancharles FAUCHEUX-Gildas KETTANJIAN"}]
[null,{"$f":"'TEMPS-ponton'!A10","v":6},{"$f":"'TEMPS-ponton'!B10","v":"BOULOGNE 92 2"},{"$f":"'TEMPS-ponton'!D10","v":"CéLia ROUSSELLE-Marie Pierre MARSALLON GAMBY-Françis ROBIN-Nicolas LECOEUR-Theodora XENOGIANI"}]
[null,{"$f":"'TEMPS-ponton'!A11","v":7},{"$f":"'TEMPS-ponton'!B11","v":"VILLENNES - POISSY AC 3"},{"$f":"'TEMPS-ponton'!D11","v":"Virginie ALEXANDRE-Jihad LEMARQRI-Cyrille BRUZON-BASCOU-Sebastien CARPENTIER-Marie Estelle D'ARBAUMONT"}]
[null,{"$f":"'TEMPS-ponton'!A12","v":8},{"$f":"'TEMPS-ponton'!B12","v":"JOINVILLE AMJ 1"},{"$f":"'TEMPS-ponton'!D12","v":"Laurent BAUDOIN-Raphaelle BOUVIER FLORY-Sophie BUSTOS-Kastriot JAKA-Thomas AUGER"}]
[null,{"$f":"'TEMPS-ponton'!A13","v":9},{"$f":"'TEMPS-ponton'!B13","v":"NOGENT SUR MARNE CN 1"},{"$f":"'TEMPS-ponton'!D13","v":"Chrystelle SUPIOT-Caroline PIEDNOIRE-Olivier MUCIGNAT-Andre SIMONNET-Fabienne LORTIE"}]
[null,{"$f":"'TEMPS-ponton'!A14","v":10},{"$f":"'TEMPS-ponton'!B14","v":"NOGENT SUR MARNE CN 2"},{"$f":"'TEMPS-ponton'!D14","v":"Christophe RUCKEBUSCH-Nicolas BURCKHART-Alice GHEERBRANT-Aurelie DONVAL-Gerard LECA"}]
[null,{"$f":"'TEMPS-ponton'!A15","v":11},{"$f":"'TEMPS-ponton'!B15","v":"BOULOGNE 92 1"},{"$f":"'TEMPS-ponton'!D15","v":"Viviane BALLOY-Timothé BAZIRIES-Alexandre LE FUR-Sigrid PABST-Michel VEDRINE"}]
[null,{"$f":"'TEMPS-ponton'!A16","v":12},{"$f":"'TEMPS-ponton'!B16","v":"EVRY SCA 2"},{"$f":"'TEMPS-ponton'!D16","v":"Laurent YEBOAH-Isabelle MOISSET FLEURISSON-Frederic DUCAUQUY-Sandrine GARCIA-Christelle MARTIN"}]
[null,{"$f":"'TEMPS-ponton'!A17","v":13},{"$f":"'TEMPS-ponton'!B17","v":"PORT-MARLY RC 2"},{"$f":"'TEMPS-ponton'!D17","v":"Elsa CROZATIER-Cyrielle BERTHIER-Hervé Valette-Eric MOINARD-Anais FEUGA"}]
[null,{"$f":"'TEMPS-ponton'!A18","v":14},{"$f":"'TEMPS-ponton'!B18","v":"MAISONS MESNIL CERAMM 1"},{"$f":"'TEMPS-ponton'!D18","v":"Nicolas SCHMITT-Gloria VENDRELL-Christine MARIE LAVAUD-Amaury DE LA LAURENCIE-Amina ELABBADI"}]
[null,{"$f":"'TEMPS-ponton'!A19","v":15},{"$f":"'TEMPS-ponton'!B19","v":"SOISY SUR SEINE CN 1"},{"$f":"'TEMPS-ponton'!D19","v":"Bertrand PIOGER-Bruno PERIQUOI-Servane BERTRAND-Alain BERNARD-Robert TRAUET"}]
[null,{"$f":"'TEMPS-ponton'!A20","v":16},{"$f":"'TEMPS-ponton'!B20","v":"PORT-MARLY RC 1"},{"$f":"'TEMPS-ponton'!D20","v":"Jean-Claude LAFOREST-David CHARTIER-Christophe MARCAIS-Vincent BONTOUX-Alain ROUSSEAU"}]
[null,{"$f":"'TEMPS-ponton'!A21","v":17},{"$f":"'TEMPS-ponton'!B21","v":"ANDRESY CA CONFLUENT 1"},{"$f":"'TEMPS-ponton'!D21","v":"Daphne PARIZOT-Agnes BURGHGRAEVE SELLEN-Sylvie FRANSSEN-Severine LEGAILLARD-Martine LE ROUX"}]
[null,{"$f":"'TEMPS-ponton'!A22","v":18},{"$f":"'TEMPS-ponton'!B22","v":"MAISONS MESNIL CERAMM 2"},{"$f":"'TEMPS-ponton'!D22","v":"Claude LEMENAGER-Didier GIRARDEAU-Laurent LIBOTTE-Alain GIRARD-Cecile JEAMMES"}]
[null,{"$f":"'TEMPS-ponton'!A23","v":19},{"$f":"'TEMPS-ponton'!B23","v":"VILLENNES - POISSY AC 1"},{"$f":"'TEMPS-ponton'!D23","v":"Olivier POLGE-Odile POLGE-Laurent BONHOMMET-Antoine VOLPI-Philippe STROHM"}]
[null,{"$f":"'TEMPS-ponton'!A24","v":20},{"$f":"'TEMPS-ponton'!B24","v":"ROUEN CNAR 1"},{"$f":"'TEMPS-ponton'!D24","v":"Nathalie MOUSSET-Francois LAIR-Betty GESLAIN-Thierry DUCHESNE-Stephane MOUSSET"}]
[null,{"$f":"'TEMPS-ponton'!A25","v":21},{"$f":"'TEMPS-ponton'!B25","v":"PORT-MARLY RC 2"},{"$f":"'TEMPS-ponton'!D25","v":"Guillaume CHARRON-Philippe VERHE-Stephan REYNIER-Dominique LEROUX-Luciano AUTUNNALE"}]
[null,{"$f":"'TEMPS-ponton'!A26","v":22},{"$f":"'TEMPS-ponton'!B26","v":"COUDRAY MONTCEAUX A 1"},{"$f":"'TEMPS-ponton'!D26","v":"Joseph RAYNAUD-Frederic MORAT-Benjamin HOUILLON-Pascal BEAUSSART-Anne HOUAL"}]
[null,{"$f":"'TEMPS-ponton'!A27","v":23},{"$f":"'TEMPS-ponton'!B27","v":"SN OISE 1"},{"$f":"'TEMPS-ponton'!D27","v":"Agnes AUDEBERT-Nicolas RAUCH-Jerome ROUGE-Nathalie BAUDIER-Isabelle JOUBERT"}]
[null,{"$f":"'TEMPS-ponton'!A28","v":24},{"$f":"'TEMPS-ponton'!B28","v":"MEULAN LES MUREAUX AMMH 1"},{"$f":"'TEMPS-ponton'!D28","v":"Xavier MARSAIS-Eric PRENEY-Yannick DAGMEY-David COINE-Arthur VAN SLOOTEN"}]
[null,{"$f":"'TEMPS-ponton'!A29","v":25},{"$f":"'TEMPS-ponton'!B29","v":"VILLENNES - POISSY AC 2"},{"$f":"'TEMPS-ponton'!D29","v":"Franck CARIOU-Michael LE BANNER-Valerie DECAESTECKER-Karine GUILBON-Christophe ELINE"}]
[null,{"$f":"'TEMPS-ponton'!A30","v":26},{"$f":"'TEMPS-ponton'!B30","v":"EVRY SCA 1"},{"$f":"'TEMPS-ponton'!D30","v":"Anne CARDUNER-Olivia PEZZOLI-Bruno CASIMIR-Lionel BOISSONNAT-Kristell MAUCHET"}]
[null,{"$f":"'TEMPS-ponton'!A31","v":27},{"$f":"'TEMPS-ponton'!B31","v":"MEULAN LES MUREAUX AMMH 1"},{"$f":"'TEMPS-ponton'!D31","v":"Gwenaelle MARSAIS-Sophie SEFFAR-Catherine MARTINIER-Christelle GOANVIC-Marie LAMORE"}]
[null,{"$f":"'TEMPS-ponton'!A32","v":28},{"$f":"'TEMPS-ponton'!B32","v":"VILLENNES - POISSY AC 1"},{"$f":"'TEMPS-ponton'!D32","v":"Frederic LE ROUX-Corinne HUARD-ROLLAND-Elodie DEREMIENCE-Marie-Claude LAUNAY-Olivier COSNEAU"}]
[null,{"$f":"'TEMPS-ponton'!A33","v":29},{"$f":"'TEMPS-ponton'!B33","v":"FONTAINEBLEAU APF 1"},{"$f":"'TEMPS-ponton'!D33","v":"Kathleen SANCHEZ-Laurent FOUQUE-Christian MESSALES-Denis FLORY-David WEBER"}]
[null,{"$f":"'TEMPS-ponton'!A34","v":30},{"$f":"'TEMPS-ponton'!B34","v":"JOINVILLE AMJ 1"},{"$f":"'TEMPS-ponton'!D34","v":"Vincent FABIEN-Arnaud PUPPO-Jonathan ROOKE-Xavier SUCHET-Nicolas JAMAULT"}]
[null,{"$f":"'TEMPS-ponton'!A35","v":31},{"$f":"'TEMPS-ponton'!B35","v":"NOGENT SUR MARNE CN 3"},{"$f":"'TEMPS-ponton'!D35","v":"Alexandra COHEN SALMON-Isabelle MILON-BANNEROT-Jerome TROMBOFSKY-Olivier PASCAL-Elisabeth LAUNAY"}]
[null,{"$f":"'TEMPS-ponton'!A36","v":32},{"$f":"'TEMPS-ponton'!B36","v":"BOULOGNE 92 1"},{"$f":"'TEMPS-ponton'!D36","v":"Isabelle MAIRE-Théo BEL BERBEL- LURBE-Thã‰Odore SEDAROS-Omar OUAZZANI-Alexandra MENEZES"}]
[null,{"$f":"'TEMPS-ponton'!A37","v":33},{"$f":"'TEMPS-ponton'!B37","v":"XX"},{"$f":"'TEMPS-ponton'!D37","v":"XX-XX-XX-XX-XX"}]
[null,{"$f":"'TEMPS-ponton'!A38","v":34},{"$f":"'TEMPS-ponton'!B38","v":"XX"},{"$f":"'TEMPS-ponton'!D38","v":"XX-XX-XX-XX-XX"}]
[null,{"$f":"'TEMPS-ponton'!A39","v":35},{"$f":"'TEMPS-ponton'!B39","v":"XX"},{"$f":"'TEMPS-ponton'!D39","v":"XX-XX-XX-XX-XX"}]
[null,{"$f":"'TEMPS-ponton'!A40","v":36},{"$f":"'TEMPS-ponton'!B40","v":"XX"},{"$f":"'TEMPS-ponton'!D40","v":"XX-XX-XX-XX-XX"}]
[null,{"$f":"'TEMPS-ponton'!A41","v":37},{"$f":"'TEMPS-ponton'!B41","v":"XX"},{"$f":"'TEMPS-ponton'!D41","v":"XX-XX-XX-XX-XX"}]
[null,{"$f":"'TEMPS-ponton'!A42","v":38},{"$f":"'TEMPS-ponton'!B42","v":"XX"},{"$f":"'TEMPS-ponton'!D42","v":"XX-XX-XX-XX-XX"}]
[null,{"$f":"'TEMPS-ponton'!A43","v":39},{"$f":"'TEMPS-ponton'!B43","v":"XX"},{"$f":"'TEMPS-ponton'!D43","v":"XX-XX-XX-XX-XX"}]
[null,{"$f":"'TEMPS-ponton'!A44","v":40},{"$f":"'TEMPS-ponton'!B44","v":"XX"},{"$f":"'TEMPS-ponton'!D44","v":"XX-XX-XX-XX-XX"}]

{"sheet":"Poissy Entrée","index":6,"n_rows":44,"n_cols":9,"rows_kept":44,"cut":false,"hidden":false,"merged":[[0,2,0,7]]}
["A C V P   GRAND HUIT",null,"Chrono ENTREE gymkhana",null,null,null,null,null,{"$f":"'Note explicative fichier'!E3","v":"2024-06-02"}]
["N° de téléphone auquel envoyer la photo des résultats : ",null,null,null,null,null,null,null,{"$f":"'Eq Chrono'!C3","v":0}]
["N°","Club",null,"1° tour",null,null,"2° tour",null,"Incidents - pénalités"]
["Yolette",null,"h","mn","s","h","mn","s"]
[1]
[2]
[3]
[4]
[5]
[6]
[7]
[8]
[9]
[10]
[11]
[12]
[13]
[14]
[15]
[16]
[17]
[18]
[19]
[20]
[21]
[22]
[23]
[24]
[25]
[26]
[27]
[28]
[29]
[30]
[31]
[32]
[33]
[34]
[35]
[36]
[37]
[38]
[39]
[40]

{"sheet":"Poissy Sortie","index":7,"n_rows":44,"n_cols":9,"rows_kept":44,"cut":false,"hidden":false,"merged":[[0,2,0,7]]}
["A C V P   GRAND HUIT",null,"Chrono SORTIE gymkhana",null,null,null,null,null,{"$f":"'Note explicative fichier'!E3","v":"2024-06-02"}]
["N° de téléphone auquel envoyer la photo des résultats : ",null,null,null,null,null,null,null,{"$f":"'Eq Chrono'!C3","v":0}]
["N°","Club",null,"1° tour",null,null,"2° tour",null,"Incidents - pénalités"]
["Yolette",null,"h","mn","s","h","mn","s"]
[1]
[2]
[3]
[4]
[5]
[6]
[7]
[8]
[9]
[10]
[11]
[12]
[13]
[14]
[15]
[16]
[17]
[18]
[19]
[20]
[21]
[22]
[23]
[24]
[25]
[26]
[27]
[28]
[29]
[30]
[31]
[32]
[33]
[34]
[35]
[36]
[37]
[38]
[39]
[40]

{"sheet":"Ponton 1-4","index":8,"n_rows":44,"n_cols":9,"rows_kept":44,"cut":false,"hidden":false,"merged":[[0,2,0,7]]}
["A C V P   GRAND HUIT",null,"Chrono 1/4 et 3/4 parcours",null,null,null,null,null,{"$f":"'Note explicative fichier'!E3","v":"2024-06-02"}]
["N° de téléphone auquel envoyer la photo des résultats : ",null,null,null,null,null,null,null,{"$f":"'Eq Chrono'!C3","v":0}]
["N°","Club",null,"1/4",null,null,"3/4",null,"Incidents - pénalités"]
["Yolette",null,"h","mn","s","h","mn","s"]
[1]
[2]
[3]
[4]
[5]
[6]
[7]
[8]
[9]
[10]
[11]
[12]
[13]
[14]
[15]
[16]
[17]
[18]
[19]
[20]
[21]
[22]
[23]
[24]
[25]
[26]
[27]
[28]
[29]
[30]
[31]
[32]
[33]
[34]
[35]
[36]
[37]
[38]
[39]
[40]

{"sheet":"Ponton D-A","index":9,"n_rows":42,"n_cols":12,"rows_kept":42,"cut":false,"hidden":false,"merged":[]}
["A C V P   GRAND HUIT",null,null,null,null,null,"Chrono Départ, 1/2, Arrivée",null,null,null,null,{"$f":"'Note explicative fichier'!E3","v":"2024-06-02"}]
["N° de téléphone auquel envoyer la photo des résultats : ",null,null,null,null,null,null,null,null,null,null,{"$f":"'Eq Chrono'!C3","v":0}]
["N°","Club",null,"Départ",null,null,"1/2",null,null,"Arrivée",null,"Incidents - pénalités"]
[1]
[2]
[3]
[4]
[5]
[6]
[7]
[8]
[9]
[10]
[11]
[12]
[13]
[14]
[15]
[16]
[17]
[18]
[19]
[20]
[21]
[22]
[23]
[24]
[25]
[26]
[27]
[28]
[29]
[30]
[31]
[32]
[33]
[34]
[35]
[36]
[37]
[38]
[39]

{"sheet":"Equipes","index":10,"n_rows":41,"n_cols":15,"rows_kept":41,"cut":false,"hidden":false,"merged":[[0,4,0,8]]}
["No.","Cat.","CLUB","VILLE","Equipage",null,null,null,null,null,{"$f":"+COUNTA(C2:C40)","v":39},null,null,null,"Params"]
[1,{"$f":"IFERROR(VLOOKUP(Equipes!$A2,'Detail Equipes'!$A:$V,21,FALSE),\"X\")","v":"M"},{"$f":"IFERROR(VLOOKUP(Equipes!$A2,'Detail Equipes'!$A:$V,3,FALSE),\"XX\")","v":"ANDRESY CA CONFLUENT 1"},{"$f":"IFERROR(VLOOKUP(Equipes!$A2,'Detail Equipes'!$A:$V,4,FALSE),\"XX\")","v":"Cac1"},{"$f":"IFERROR(VLOOKUP(Equipes!$A2,'Detail Equipes'!$A:$V,6,FALSE),\"XX\")","v":"Stephanie LAPORTE"},{"$f":"IFERROR(VLOOKUP(Equipes!$A2,'Detail Equipes'!$A:$V,9,FALSE),\"XX\")","v":"Marine NACERI"},{"$f":"IFERROR(VLOOKUP(Equipes!$A2,'Detail Equipes'!$A:$V,12,FALSE),\"XX\")","v":"Marc LACCASSAGNE"},{"$f":"IFERROR(VLOOKUP(Equipes!$A2,'Detail Equipes'!$A:$V,15,FALSE),\"XX\")","v":"Stephane ZETTWOOG"},{"$f":"IFERROR(VLOOKUP(Equipes!$A2,'Detail Equipes'!$A:$V,18,FALSE),\"XX\")","v":"Fouzia VOIRIN"},{"$f":"IFERROR(VLOOKUP(Equipes!$A2,'Detail Equipes'!$A:$V,22,FALSE),0)","v":49.431465377029433},null," ",null,{"$f":"+COUNTIF($B$2:$B$40,O2)","v":18},"M"]
[2,{"$f":"IFERROR(VLOOKUP(Equipes!$A3,'Detail Equipes'!$A:$V,21,FALSE),\"X\")","v":"M"},{"$f":"IFERROR(VLOOKUP(Equipes!$A3,'Detail Equipes'!$A:$V,3,FALSE),\"XX\")","v":"CAUDEBEC EN CAUX ACVS 1"},{"$f":"IFERROR(VLOOKUP(Equipes!$A3,'Detail Equipes'!$A:$V,4,FALSE),\"XX\")","v":"Caudebec"},{"$f":"IFERROR(VLOOKUP(Equipes!$A3,'Detail Equipes'!$A:$V,6,FALSE),\"XX\")","v":"Martine NARBAIS-JAUREGUY"},{"$f":"IFERROR(VLOOKUP(Equipes!$A3,'Detail Equipes'!$A:$V,9,FALSE),\"XX\")","v":"Caroline KERVRANN"},{"$f":"IFERROR(VLOOKUP(Equipes!$A3,'Detail Equipes'!$A:$V,12,FALSE),\"XX\")","v":"Stephane DELAMARE"},{"$f":"IFERROR(VLOOKUP(Equipes!$A3,'Detail Equipes'!$A:$V,15,FALSE),\"XX\")","v":"Nicolas BARRAY"},{"$f":"IFERROR(VLOOKUP(Equipes!$A3,'Detail Equipes'!$A:$V,18,FALSE),\"XX\")","v":"Francois NARBAIS-JAUREGUY"},{"$f":"IFERROR(VLOOKUP(Equipes!$A3,'Detail Equipes'!$A:$V,22,FALSE),0)","v":55.146533870180107},null,"-",null,{"$f":"+COUNTIF($B$2:$B$40,O3)","v":2},"F"]
[3,{"$f":"IFERROR(VLOOKUP(Equipes!$A4,'Detail Equipes'!$A:$V,21,FALSE),\"X\")","v":"M"},{"$f":"IFERROR(VLOOKUP(Equipes!$A4,'Detail Equipes'!$A:$V,3,FALSE),\"XX\")","v":"ANDRESY CA CONFLUENT 2"},{"$f":"IFERROR(VLOOKUP(Equipes!$A4,'Detail Equipes'!$A:$V,4,FALSE),\"XX\")","v":"CAC 2"},{"$f":"IFERROR(VLOOKUP(Equipes!$A4,'Detail Equipes'!$A:$V,6,FALSE),\"XX\")","v":"Anna ALCALOIDEPOIXBLANC"},{"$f":"IFERROR(VLOOKUP(Equipes!$A4,'Detail Equipes'!$A:$V,9,FALSE),\"XX\")","v":"Geoffrey GHIZZONI"},{"$f":"IFERROR(VLOOKUP(Equipes!$A4,'Detail Equipes'!$A:$V,12,FALSE),\"XX\")","v":"Nathalie BOURGEOIS"},{"$f":"IFERROR(VLOOKUP(Equipes!$A4,'Detail Equipes'!$A:$V,15,FALSE),\"XX\")","v":"Franck CHRISTIANNOT"},{"$f":"IFERROR(VLOOKUP(Equipes!$A4,'Detail Equipes'!$A:$V,18,FALSE),\"XX\")","v":"NicOLAS delaunoy"},{"$f":"IFERROR(VLOOKUP(Equipes!$A4,'Detail Equipes'!$A:$V,22,FALSE),0)","v":55.448451678399294},null,null,null,{"$f":"+COUNTIF($B$2:$B$40,O4)","v":12},"H"]
[4,{"$f":"IFERROR(VLOOKUP(Equipes!$A5,'Detail Equipes'!$A:$V,21,FALSE),\"X\")","v":"H"},{"$f":"IFERROR(VLOOKUP(Equipes!$A5,'Detail Equipes'!$A:$V,3,FALSE),\"XX\")","v":"ANDRESY CA CONFLUENT 1"},{"$f":"IFERROR(VLOOKUP(Equipes!$A5,'Detail Equipes'!$A:$V,4,FALSE),\"XX\")","v":"CAC3"},{"$f":"IFERROR(VLOOKUP(Equipes!$A5,'Detail Equipes'!$A:$V,6,FALSE),\"XX\")","v":"Emmanuel SALIN"},{"$f":"IFERROR(VLOOKUP(Equipes!$A5,'Detail Equipes'!$A:$V,9,FALSE),\"XX\")","v":"Ousseni PARKOUDA"},{"$f":"IFERROR(VLOOKUP(Equipes!$A5,'Detail Equipes'!$A:$V,12,FALSE),\"XX\")","v":"Jean-Baptiste PROVENZANO"},{"$f":"IFERROR(VLOOKUP(Equipes!$A5,'Detail Equipes'!$A:$V,15,FALSE),\"XX\")","v":"Jerome CLAVE"},{"$f":"IFERROR(VLOOKUP(Equipes!$A5,'Detail Equipes'!$A:$V,18,FALSE),\"XX\")","v":"Julian GALLELA"},{"$f":"IFERROR(VLOOKUP(Equipes!$A5,'Detail Equipes'!$A:$V,22,FALSE),0)","v":45.693931130454089},null,null,"Total",{"$f":"+SUM(N2:N4)","v":32}]
[5,{"$f":"IFERROR(VLOOKUP(Equipes!$A6,'Detail Equipes'!$A:$V,21,FALSE),\"X\")","v":"M"},{"$f":"IFERROR(VLOOKUP(Equipes!$A6,'Detail Equipes'!$A:$V,3,FALSE),\"XX\")","v":"PORT-MARLY RC 1"},{"$f":"IFERROR(VLOOKUP(Equipes!$A6,'Detail Equipes'!$A:$V,4,FALSE),\"XX\")","v":"RCPM"},{"$f":"IFERROR(VLOOKUP(Equipes!$A6,'Detail Equipes'!$A:$V,6,FALSE),\"XX\")","v":"Claudie BODIN"},{"$f":"IFERROR(VLOOKUP(Equipes!$A6,'Detail Equipes'!$A:$V,9,FALSE),\"XX\")","v":"Fanny LAMOUR"},{"$f":"IFERROR(VLOOKUP(Equipes!$A6,'Detail Equipes'!$A:$V,12,FALSE),\"XX\")","v":"Etienne DUPUIS"},{"$f":"IFERROR(VLOOKUP(Equipes!$A6,'Detail Equipes'!$A:$V,15,FALSE),\"XX\")","v":"Jeancharles FAUCHEUX"},{"$f":"IFERROR(VLOOKUP(Equipes!$A6,'Detail Equipes'!$A:$V,18,FALSE),\"XX\")","v":"Gildas KETTANJIAN"},{"$f":"IFERROR(VLOOKUP(Equipes!$A6,'Detail Equipes'!$A:$V,22,FALSE),0)","v":50.43420510305684}]
[6,{"$f":"IFERROR(VLOOKUP(Equipes!$A7,'Detail Equipes'!$A:$V,21,FALSE),\"X\")","v":"M"},{"$f":"IFERROR(VLOOKUP(Equipes!$A7,'Detail Equipes'!$A:$V,3,FALSE),\"XX\")","v":"BOULOGNE 92 2"},{"$f":"IFERROR(VLOOKUP(Equipes!$A7,'Detail Equipes'!$A:$V,4,FALSE),\"XX\")","v":"ACBB"},{"$f":"IFERROR(VLOOKUP(Equipes!$A7,'Detail Equipes'!$A:$V,6,FALSE),\"XX\")","v":"CéLia ROUSSELLE"},{"$f":"IFERROR(VLOOKUP(Equipes!$A7,'Detail Equipes'!$A:$V,9,FALSE),\"XX\")","v":"Marie Pierre MARSALLON GAMBY"},{"$f":"IFERROR(VLOOKUP(Equipes!$A7,'Detail Equipes'!$A:$V,12,FALSE),\"XX\")","v":"Françis ROBIN"},{"$f":"IFERROR(VLOOKUP(Equipes!$A7,'Detail Equipes'!$A:$V,15,FALSE),\"XX\")","v":"Nicolas LECOEUR"},{"$f":"IFERROR(VLOOKUP(Equipes!$A7,'Detail Equipes'!$A:$V,18,FALSE),\"XX\")","v":"Theodora XENOGIANI"},{"$f":"IFERROR(VLOOKUP(Equipes!$A7,'Detail Equipes'!$A:$V,22,FALSE),0)","v":45.90927359620752}]
[7,{"$f":"IFERROR(VLOOKUP(Equipes!$A8,'Detail Equipes'!$A:$V,21,FALSE),\"X\")","v":"M"},{"$f":"IFERROR(VLOOKUP(Equipes!$A8,'Detail Equipes'!$A:$V,3,FALSE),\"XX\")","v":"VILLENNES - POISSY AC 3"},{"$f":"IFERROR(VLOOKUP(Equipes!$A8,'Detail Equipes'!$A:$V,4,FALSE),\"XX\")","v":"ACVP"},{"$f":"IFERROR(VLOOKUP(Equipes!$A8,'Detail Equipes'!$A:$V,6,FALSE),\"XX\")","v":"Virginie ALEXANDRE"},{"$f":"IFERROR(VLOOKUP(Equipes!$A8,'Detail Equipes'!$A:$V,9,FALSE),\"XX\")","v":"Jihad LEMARQRI"},{"$f":"IFERROR(VLOOKUP(Equipes!$A8,'Detail Equipes'!$A:$V,12,FALSE),\"XX\")","v":"Cyrille BRUZON-BASCOU"},{"$f":"IFERROR(VLOOKUP(Equipes!$A8,'Detail Equipes'!$A:$V,15,FALSE),\"XX\")","v":"Sebastien CARPENTIER"},{"$f":"IFERROR(VLOOKUP(Equipes!$A8,'Detail Equipes'!$A:$V,18,FALSE),\"XX\")","v":"Marie Estelle D'ARBAUMONT"},{"$f":"IFERROR(VLOOKUP(Equipes!$A8,'Detail Equipes'!$A:$V,22,FALSE),0)","v":48.766807842782853}]
[8,{"$f":"IFERROR(VLOOKUP(Equipes!$A9,'Detail Equipes'!$A:$V,21,FALSE),\"X\")","v":"M"},{"$f":"IFERROR(VLOOKUP(Equipes!$A9,'Detail Equipes'!$A:$V,3,FALSE),\"XX\")","v":"JOINVILLE AMJ 1"},{"$f":"IFERROR(VLOOKUP(Equipes!$A9,'Detail Equipes'!$A:$V,4,FALSE),\"XX\")","v":"Joinville"},{"$f":"IFERROR(VLOOKUP(Equipes!$A9,'Detail Equipes'!$A:$V,6,FALSE),\"XX\")","v":"Laurent BAUDOIN"},{"$f":"IFERROR(VLOOKUP(Equipes!$A9,'Detail Equipes'!$A:$V,9,FALSE),\"XX\")","v":"Raphaelle BOUVIER FLORY"},{"$f":"IFERROR(VLOOKUP(Equipes!$A9,'Detail Equipes'!$A:$V,12,FALSE),\"XX\")","v":"Sophie BUSTOS"},{"$f":"IFERROR(VLOOKUP(Equipes!$A9,'Detail Equipes'!$A:$V,15,FALSE),\"XX\")","v":"Kastriot JAKA"},{"$f":"IFERROR(VLOOKUP(Equipes!$A9,'Detail Equipes'!$A:$V,18,FALSE),\"XX\")","v":"Thomas AUGER"},{"$f":"IFERROR(VLOOKUP(Equipes!$A9,'Detail Equipes'!$A:$V,22,FALSE),0)","v":46.081328390728068}]
[9,{"$f":"IFERROR(VLOOKUP(Equipes!$A10,'Detail Equipes'!$A:$V,21,FALSE),\"X\")","v":"M"},{"$f":"IFERROR(VLOOKUP(Equipes!$A10,'Detail Equipes'!$A:$V,3,FALSE),\"XX\")","v":"NOGENT SUR MARNE CN 1"},{"$f":"IFERROR(VLOOKUP(Equipes!$A10,'Detail Equipes'!$A:$V,4,FALSE),\"XX\")","v":"CN 1"},{"$f":"IFERROR(VLOOKUP(Equipes!$A10,'Detail Equipes'!$A:$V,6,FALSE),\"XX\")","v":"Chrystelle SUPIOT"},{"$f":"IFERROR(VLOOKUP(Equipes!$A10,'Detail Equipes'!$A:$V,9,FALSE),\"XX\")","v":"Caroline PIEDNOIRE"},{"$f":"IFERROR(VLOOKUP(Equipes!$A10,'Detail Equipes'!$A:$V,12,FALSE),\"XX\")","v":"Olivier MUCIGNAT"},{"$f":"IFERROR(VLOOKUP(Equipes!$A10,'Detail Equipes'!$A:$V,15,FALSE),\"XX\")","v":"Andre SIMONNET"},{"$f":"IFERROR(VLOOKUP(Equipes!$A10,'Detail Equipes'!$A:$V,18,FALSE),\"XX\")","v":"Fabienne LORTIE"},{"$f":"IFERROR(VLOOKUP(Equipes!$A10,'Detail Equipes'!$A:$V,22,FALSE),0)","v":53.262150308536278}]
[10,{"$f":"IFERROR(VLOOKUP(Equipes!$A11,'Detail Equipes'!$A:$V,21,FALSE),\"X\")","v":"M"},{"$f":"IFERROR(VLOOKUP(Equipes!$A11,'Detail Equipes'!$A:$V,3,FALSE),\"XX\")","v":"NOGENT SUR MARNE CN 2"},{"$f":"IFERROR(VLOOKUP(Equipes!$A11,'Detail Equipes'!$A:$V,4,FALSE),\"XX\")","v":"CN2"},{"$f":"IFERROR(VLOOKUP(Equipes!$A11,'Detail Equipes'!$A:$V,6,FALSE),\"XX\")","v":"Christophe RUCKEBUSCH"},{"$f":"IFERROR(VLOOKUP(Equipes!$A11,'Detail Equipes'!$A:$V,9,FALSE),\"XX\")","v":"Nicolas BURCKHART"},{"$f":"IFERROR(VLOOKUP(Equipes!$A11,'Detail Equipes'!$A:$V,12,FALSE),\"XX\")","v":"Alice GHEERBRANT"},{"$f":"IFERROR(VLOOKUP(Equipes!$A11,'Detail Equipes'!$A:$V,15,FALSE),\"XX\")","v":"Aurelie DONVAL"},{"$f":"IFERROR(VLOOKUP(Equipes!$A11,'Detail Equipes'!$A:$V,18,FALSE),\"XX\")","v":"Gerard LECA"},{"$f":"IFERROR(VLOOKUP(Equipes!$A11,'Detail Equipes'!$A:$V,22,FALSE),0)","v":52.515848938673265}]
[11,{"$f":"IFERROR(VLOOKUP(Equipes!$A12,'Detail Equipes'!$A:$V,21,FALSE),\"X\")","v":"H"},{"$f":"IFERROR(VLOOKUP(Equipes!$A12,'Detail Equipes'!$A:$V,3,FALSE),\"XX\")","v":"BOULOGNE 92 1"},{"$f":"IFERROR(VLOOKUP(Equipes!$A12,'Detail Equipes'!$A:$V,4,FALSE),\"XX\")","v":"ACBB"},{"$f":"IFERROR(VLOOKUP(Equipes!$A12,'Detail Equipes'!$A:$V,6,FALSE),\"XX\")","v":"Viviane BALLOY"},{"$f":"IFERROR(VLOOKUP(Equipes!$A12,'Detail Equipes'!$A:$V,9,FALSE),\"XX\")","v":"Timothé BAZIRIES"},{"$f":"IFERROR(VLOOKUP(Equipes!$A12,'Detail Equipes'!$A:$V,12,FALSE),\"XX\")","v":"Alexandre LE FUR"},{"$f":"IFERROR(VLOOKUP(Equipes!$A12,'Detail Equipes'!$A:$V,15,FALSE),\"XX\")","v":"Sigrid PABST"},{"$f":"IFERROR(VLOOKUP(Equipes!$A12,'Detail Equipes'!$A:$V,18,FALSE),\"XX\")","v":"Michel VEDRINE"},{"$f":"IFERROR(VLOOKUP(Equipes!$A12,'Detail Equipes'!$A:$V,22,FALSE),0)","v":50.552013322234913}]
[12,{"$f":"IFERROR(VLOOKUP(Equipes!$A13,'Detail Equipes'!$A:$V,21,FALSE),\"X\")","v":"M"},{"$f":"IFERROR(VLOOKUP(Equipes!$A13,'Detail Equipes'!$A:$V,3,FALSE),\"XX\")","v":"EVRY SCA 2"},{"$f":"IFERROR(VLOOKUP(Equipes!$A13,'Detail Equipes'!$A:$V,4,FALSE),\"XX\")","v":"SCA2"},{"$f":"IFERROR(VLOOKUP(Equipes!$A13,'Detail Equipes'!$A:$V,6,FALSE),\"XX\")","v":"Laurent YEBOAH"},{"$f":"IFERROR(VLOOKUP(Equipes!$A13,'Detail Equipes'!$A:$V,9,FALSE),\"XX\")","v":"Isabelle MOISSET FLEURISSON"},{"$f":"IFERROR(VLOOKUP(Equipes!$A13,'Detail Equipes'!$A:$V,12,FALSE),\"XX\")","v":"Frederic DUCAUQUY"},{"$f":"IFERROR(VLOOKUP(Equipes!$A13,'Detail Equipes'!$A:$V,15,FALSE),\"XX\")","v":"Sandrine GARCIA"},{"$f":"IFERROR(VLOOKUP(Equipes!$A13,'Detail Equipes'!$A:$V,18,FALSE),\"XX\")","v":"Christelle MARTIN"},{"$f":"IFERROR(VLOOKUP(Equipes!$A13,'Detail Equipes'!$A:$V,22,FALSE),0)","v":47.962972226344498}]
[13,{"$f":"IFERROR(VLOOKUP(Equipes!$A14,'Detail Equipes'!$A:$V,21,FALSE),\"X\")","v":"M"},{"$f":"IFERROR(VLOOKUP(Equipes!$A14,'Detail Equipes'!$A:$V,3,FALSE),\"XX\")","v":"PORT-MARLY RC 2"},{"$f":"IFERROR(VLOOKUP(Equipes!$A14,'Detail Equipes'!$A:$V,4,FALSE),\"XX\")","v":"RCPM2"},{"$f":"IFERROR(VLOOKUP(Equipes!$A14,'Detail Equipes'!$A:$V,6,FALSE),\"XX\")","v":"Elsa CROZATIER"},{"$f":"IFERROR(VLOOKUP(Equipes!$A14,'Detail Equipes'!$A:$V,9,FALSE),\"XX\")","v":"Cyrielle BERTHIER"},{"$f":"IFERROR(VLOOKUP(Equipes!$A14,'Detail Equipes'!$A:$V,12,FALSE),\"XX\")","v":"Hervé Valette"},{"$f":"IFERROR(VLOOKUP(Equipes!$A14,'Detail Equipes'!$A:$V,15,FALSE),\"XX\")","v":"Eric MOINARD"},{"$f":"IFERROR(VLOOKUP(Equipes!$A14,'Detail Equipes'!$A:$V,18,FALSE),\"XX\")","v":"Anais FEUGA"},{"$f":"IFERROR(VLOOKUP(Equipes!$A14,'Detail Equipes'!$A:$V,22,FALSE),0)","v":46.709821541413007}]
[14,{"$f":"IFERROR(VLOOKUP(Equipes!$A15,'Detail Equipes'!$A:$V,21,FALSE),\"X\")","v":"M"},{"$f":"IFERROR(VLOOKUP(Equipes!$A15,'Detail Equipes'!$A:$V,3,FALSE),\"XX\")","v":"MAISONS MESNIL CERAMM 1"},{"$f":"IFERROR(VLOOKUP(Equipes!$A15,'Detail Equipes'!$A:$V,4,FALSE),\"XX\")","v":"CERAMM1"},{"$f":"IFERROR(VLOOKUP(Equipes!$A15,'Detail Equipes'!$A:$V,6,FALSE),\"XX\")","v":"Nicolas SCHMITT"},{"$f":"IFERROR(VLOOKUP(Equipes!$A15,'Detail Equipes'!$A:$V,9,FALSE),\"XX\")","v":"Gloria VENDRELL"},{"$f":"IFERROR(VLOOKUP(Equipes!$A15,'Detail Equipes'!$A:$V,12,FALSE),\"XX\")","v":"Christine MARIE LAVAUD"},{"$f":"IFERROR(VLOOKUP(Equipes!$A15,'Detail Equipes'!$A:$V,15,FALSE),\"XX\")","v":"Amaury DE LA LAURENCIE"},{"$f":"IFERROR(VLOOKUP(Equipes!$A15,'Detail Equipes'!$A:$V,18,FALSE),\"XX\")","v":"Amina ELABBADI"},{"$f":"IFERROR(VLOOKUP(Equipes!$A15,'Detail Equipes'!$A:$V,22,FALSE),0)","v":50.254479075659567}]
[15,{"$f":"IFERROR(VLOOKUP(Equipes!$A16,'Detail Equipes'!$A:$V,21,FALSE),\"X\")","v":"H"},{"$f":"IFERROR(VLOOKUP(Equipes!$A16,'Detail Equipes'!$A:$V,3,FALSE),\"XX\")","v":"SOISY SUR SEINE CN 1"},{"$f":"IFERROR(VLOOKUP(Equipes!$A16,'Detail Equipes'!$A:$V,4,FALSE),\"XX\")","v":"CN1"},{"$f":"IFERROR(VLOOKUP(Equipes!$A16,'Detail Equipes'!$A:$V,6,FALSE),\"XX\")","v":"Bertrand PIOGER"},{"$f":"IFERROR(VLOOKUP(Equipes!$A16,'Detail Equipes'!$A:$V,9,FALSE),\"XX\")","v":"Bruno PERIQUOI"},{"$f":"IFERROR(VLOOKUP(Equipes!$A16,'Detail Equipes'!$A:$V,12,FALSE),\"XX\")","v":"Servane BERTRAND"},{"$f":"IFERROR(VLOOKUP(Equipes!$A16,'Detail Equipes'!$A:$V,15,FALSE),\"XX\")","v":"Alain BERNARD"},{"$f":"IFERROR(VLOOKUP(Equipes!$A16,'Detail Equipes'!$A:$V,18,FALSE),\"XX\")","v":"Robert TRAUET"},{"$f":"IFERROR(VLOOKUP(Equipes!$A16,'Detail Equipes'!$A:$V,22,FALSE),0)","v":54.245164007166423}]
[16,{"$f":"IFERROR(VLOOKUP(Equipes!$A17,'Detail Equipes'!$A:$V,21,FALSE),\"X\")","v":"H"},{"$f":"IFERROR(VLOOKUP(Equipes!$A17,'Detail Equipes'!$A:$V,3,FALSE),\"XX\")","v":"PORT-MARLY RC 1"},{"$f":"IFERROR(VLOOKUP(Equipes!$A17,'Detail Equipes'!$A:$V,4,FALSE),\"XX\")","v":"RCPM1"},{"$f":"IFERROR(VLOOKUP(Equipes!$A17,'Detail Equipes'!$A:$V,6,FALSE),\"XX\")","v":"Jean-Claude LAFOREST"},{"$f":"IFERROR(VLOOKUP(Equipes!$A17,'Detail Equipes'!$A:$V,9,FALSE),\"XX\")","v":"David CHARTIER"},{"$f":"IFERROR(VLOOKUP(Equipes!$A17,'Detail Equipes'!$A:$V,12,FALSE),\"XX\")","v":"Christophe MARCAIS"},{"$f":"IFERROR(VLOOKUP(Equipes!$A17,'Detail Equipes'!$A:$V,15,FALSE),\"XX\")","v":"Vincent BONTOUX"},{"$f":"IFERROR(VLOOKUP(Equipes!$A17,'Detail Equipes'!$A:$V,18,FALSE),\"XX\")","v":"Alain ROUSSEAU"},{"$f":"IFERROR(VLOOKUP(Equipes!$A17,'Detail Equipes'!$A:$V,22,FALSE),0)","v":54.613931130454091}]
[17,{"$f":"IFERROR(VLOOKUP(Equipes!$A18,'Detail Equipes'!$A:$V,21,FALSE),\"X\")","v":"F"},{"$f":"IFERROR(VLOOKUP(Equipes!$A18,'Detail Equipes'!$A:$V,3,FALSE),\"XX\")","v":"ANDRESY CA CONFLUENT 1"},{"$f":"IFERROR(VLOOKUP(Equipes!$A18,'Detail Equipes'!$A:$V,4,FALSE),\"XX\")","v":"CAC1"},{"$f":"IFERROR(VLOOKUP(Equipes!$A18,'Detail Equipes'!$A:$V,6,FALSE),\"XX\")","v":"Daphne PARIZOT"},{"$f":"IFERROR(VLOOKUP(Equipes!$A18,'Detail Equipes'!$A:$V,9,FALSE),\"XX\")","v":"Agnes BURGHGRAEVE SELLEN"},{"$f":"IFERROR(VLOOKUP(Equipes!$A18,'Detail Equipes'!$A:$V,12,FALSE),\"XX\")","v":"Sylvie FRANSSEN"},{"$f":"IFERROR(VLOOKUP(Equipes!$A18,'Detail Equipes'!$A:$V,15,FALSE),\"XX\")","v":"Severine LEGAILLARD"},{"$f":"IFERROR(VLOOKUP(Equipes!$A18,'Detail Equipes'!$A:$V,18,FALSE),\"XX\")","v":"Martine LE ROUX"},{"$f":"IFERROR(VLOOKUP(Equipes!$A18,'Detail Equipes'!$A:$V,22,FALSE),0)","v":55.086259897577371}]
[18,{"$f":"IFERROR(VLOOKUP(Equipes!$A19,'Detail Equipes'!$A:$V,21,FALSE),\"X\")","v":"H"},{"$f":"IFERROR(VLOOKUP(Equipes!$A19,'Detail Equipes'!$A:$V,3,FALSE),\"XX\")","v":"MAISONS MESNIL CERAMM 2"},{"$f":"IFERROR(VLOOKUP(Equipes!$A19,'Detail Equipes'!$A:$V,4,FALSE),\"XX\")","v":"CERAMM2"},{"$f":"IFERROR(VLOOKUP(Equipes!$A19,'Detail Equipes'!$A:$V,6,FALSE),\"XX\")","v":"Claude LEMENAGER"},{"$f":"IFERROR(VLOOKUP(Equipes!$A19,'Detail Equipes'!$A:$V,9,FALSE),\"XX\")","v":"Didier GIRARDEAU"},{"$f":"IFERROR(VLOOKUP(Equipes!$A19,'Detail Equipes'!$A:$V,12,FALSE),\"XX\")","v":"Laurent LIBOTTE"},{"$f":"IFERROR(VLOOKUP(Equipes!$A19,'Detail Equipes'!$A:$V,15,FALSE),\"XX\")","v":"Alain GIRARD"},{"$f":"IFERROR(VLOOKUP(Equipes!$A19,'Detail Equipes'!$A:$V,18,FALSE),\"XX\")","v":"Cecile JEAMMES"},{"$f":"IFERROR(VLOOKUP(Equipes!$A19,'Detail Equipes'!$A:$V,22,FALSE),0)","v":58.073109212645861}]
[19,{"$f":"IFERROR(VLOOKUP(Equipes!$A20,'Detail Equipes'!$A:$V,21,FALSE),\"X\")","v":"H"},{"$f":"IFERROR(VLOOKUP(Equipes!$A20,'Detail Equipes'!$A:$V,3,FALSE),\"XX\")","v":"VILLENNES - POISSY AC 1"},{"$f":"IFERROR(VLOOKUP(Equipes!$A20,'Detail Equipes'!$A:$V,4,FALSE),\"XX\")","v":"ACVP1"},{"$f":"IFERROR(VLOOKUP(Equipes!$A20,'Detail Equipes'!$A:$V,6,FALSE),\"XX\")","v":"Olivier POLGE"},{"$f":"IFERROR(VLOOKUP(Equipes!$A20,'Detail Equipes'!$A:$V,9,FALSE),\"XX\")","v":"Odile POLGE"},{"$f":"IFERROR(VLOOKUP(Equipes!$A20,'Detail Equipes'!$A:$V,12,FALSE),\"XX\")","v":"Laurent BONHOMMET"},{"$f":"IFERROR(VLOOKUP(Equipes!$A20,'Detail Equipes'!$A:$V,15,FALSE),\"XX\")","v":"Antoine VOLPI"},{"$f":"IFERROR(VLOOKUP(Equipes!$A20,'Detail Equipes'!$A:$V,18,FALSE),\"XX\")","v":"Philippe STROHM"},{"$f":"IFERROR(VLOOKUP(Equipes!$A20,'Detail Equipes'!$A:$V,22,FALSE),0)","v":55.204068116755458}]
[20,{"$f":"IFERROR(VLOOKUP(Equipes!$A21,'Detail Equipes'!$A:$V,21,FALSE),\"X\")","v":"M"},{"$f":"IFERROR(VLOOKUP(Equipes!$A21,'Detail Equipes'!$A:$V,3,FALSE),\"XX\")","v":"ROUEN CNAR 1"},{"$f":"IFERROR(VLOOKUP(Equipes!$A21,'Detail Equipes'!$A:$V,4,FALSE),\"XX\")","v":"CNAR1"},{"$f":"IFERROR(VLOOKUP(Equipes!$A21,'Detail Equipes'!$A:$V,6,FALSE),\"XX\")","v":"Nathalie MOUSSET"},{"$f":"IFERROR(VLOOKUP(Equipes!$A21,'Detail Equipes'!$A:$V,9,FALSE),\"XX\")","v":"Francois LAIR"},{"$f":"IFERROR(VLOOKUP(Equipes!$A21,'Detail Equipes'!$A:$V,12,FALSE),\"XX\")","v":"Betty GESLAIN"},{"$f":"IFERROR(VLOOKUP(Equipes!$A21,'Detail Equipes'!$A:$V,15,FALSE),\"XX\")","v":"Thierry DUCHESNE"},{"$f":"IFERROR(VLOOKUP(Equipes!$A21,'Detail Equipes'!$A:$V,18,FALSE),\"XX\")","v":"Stephane MOUSSET"},{"$f":"IFERROR(VLOOKUP(Equipes!$A21,'Detail Equipes'!$A:$V,22,FALSE),0)","v":55.385985924974634}]
[21,{"$f":"IFERROR(VLOOKUP(Equipes!$A22,'Detail Equipes'!$A:$V,21,FALSE),\"X\")","v":"H"},{"$f":"IFERROR(VLOOKUP(Equipes!$A22,'Detail Equipes'!$A:$V,3,FALSE),\"XX\")","v":"PORT-MARLY RC 2"},{"$f":"IFERROR(VLOOKUP(Equipes!$A22,'Detail Equipes'!$A:$V,4,FALSE),\"XX\")","v":"RCPM2"},{"$f":"IFERROR(VLOOKUP(Equipes!$A22,'Detail Equipes'!$A:$V,6,FALSE),\"XX\")","v":"Guillaume CHARRON"},{"$f":"IFERROR(VLOOKUP(Equipes!$A22,'Detail Equipes'!$A:$V,9,FALSE),\"XX\")","v":"Philippe VERHE"},{"$f":"IFERROR(VLOOKUP(Equipes!$A22,'Detail Equipes'!$A:$V,12,FALSE),\"XX\")","v":"Stephan REYNIER"},{"$f":"IFERROR(VLOOKUP(Equipes!$A22,'Detail Equipes'!$A:$V,15,FALSE),\"XX\")","v":"Dominique LEROUX"},{"$f":"IFERROR(VLOOKUP(Equipes!$A22,'Detail Equipes'!$A:$V,18,FALSE),\"XX\")","v":"Luciano AUTUNNALE"},{"$f":"IFERROR(VLOOKUP(Equipes!$A22,'Detail Equipes'!$A:$V,22,FALSE),0)","v":50.87475304826232}]
[22,{"$f":"IFERROR(VLOOKUP(Equipes!$A23,'Detail Equipes'!$A:$V,21,FALSE),\"X\")","v":"H"},{"$f":"IFERROR(VLOOKUP(Equipes!$A23,'Detail Equipes'!$A:$V,3,FALSE),\"XX\")","v":"COUDRAY MONTCEAUX A 1"},{"$f":"IFERROR(VLOOKUP(Equipes!$A23,'Detail Equipes'!$A:$V,4,FALSE),\"XX\")","v":"coudray1"},{"$f":"IFERROR(VLOOKUP(Equipes!$A23,'Detail Equipes'!$A:$V,6,FALSE),\"XX\")","v":"Joseph RAYNAUD"},{"$f":"IFERROR(VLOOKUP(Equipes!$A23,'Detail Equipes'!$A:$V,9,FALSE),\"XX\")","v":"Frederic MORAT"},{"$f":"IFERROR(VLOOKUP(Equipes!$A23,'Detail Equipes'!$A:$V,12,FALSE),\"XX\")","v":"Benjamin HOUILLON"},{"$f":"IFERROR(VLOOKUP(Equipes!$A23,'Detail Equipes'!$A:$V,15,FALSE),\"XX\")","v":"Pascal BEAUSSART"},{"$f":"IFERROR(VLOOKUP(Equipes!$A23,'Detail Equipes'!$A:$V,18,FALSE),\"XX\")","v":"Anne HOUAL"},{"$f":"IFERROR(VLOOKUP(Equipes!$A23,'Detail Equipes'!$A:$V,22,FALSE),0)","v":51.871465377029423}]
[23,{"$f":"IFERROR(VLOOKUP(Equipes!$A24,'Detail Equipes'!$A:$V,21,FALSE),\"X\")","v":"M"},{"$f":"IFERROR(VLOOKUP(Equipes!$A24,'Detail Equipes'!$A:$V,3,FALSE),\"XX\")","v":"SN OISE 1"},{"$f":"IFERROR(VLOOKUP(Equipes!$A24,'Detail Equipes'!$A:$V,4,FALSE),\"XX\")","v":"SN Oise 1\n"},{"$f":"IFERROR(VLOOKUP(Equipes!$A24,'Detail Equipes'!$A:$V,6,FALSE),\"XX\")","v":"Agnes AUDEBERT"},{"$f":"IFERROR(VLOOKUP(Equipes!$A24,'Detail Equipes'!$A:$V,9,FALSE),\"XX\")","v":"Nicolas RAUCH"},{"$f":"IFERROR(VLOOKUP(Equipes!$A24,'Detail Equipes'!$A:$V,12,FALSE),\"XX\")","v":"Jerome ROUGE"},{"$f":"IFERROR(VLOOKUP(Equipes!$A24,'Detail Equipes'!$A:$V,15,FALSE),\"XX\")","v":"Nathalie BAUDIER"},{"$f":"IFERROR(VLOOKUP(Equipes!$A24,'Detail Equipes'!$A:$V,18,FALSE),\"XX\")","v":"Isabelle JOUBERT"},{"$f":"IFERROR(VLOOKUP(Equipes!$A24,'Detail Equipes'!$A:$V,22,FALSE),0)","v":49.531739349632183}]
[24,{"$f":"IFERROR(VLOOKUP(Equipes!$A25,'Detail Equipes'!$A:$V,21,FALSE),\"X\")","v":"H"},{"$f":"IFERROR(VLOOKUP(Equipes!$A25,'Detail Equipes'!$A:$V,3,FALSE),\"XX\")","v":"MEULAN LES MUREAUX AMMH 1"},{"$f":"IFERROR(VLOOKUP(Equipes!$A25,'Detail Equipes'!$A:$V,4,FALSE),\"XX\")","v":"AMMH1"},{"$f":"IFERROR(VLOOKUP(Equipes!$A25,'Detail Equipes'!$A:$V,6,FALSE),\"XX\")","v":"Xavier MARSAIS"},{"$f":"IFERROR(VLOOKUP(Equipes!$A25,'Detail Equipes'!$A:$V,9,FALSE),\"XX\")","v":"Eric PRENEY"},{"$f":"IFERROR(VLOOKUP(Equipes!$A25,'Detail Equipes'!$A:$V,12,FALSE),\"XX\")","v":"Yannick DAGMEY"},{"$f":"IFERROR(VLOOKUP(Equipes!$A25,'Detail Equipes'!$A:$V,15,FALSE),\"XX\")","v":"David COINE"},{"$f":"IFERROR(VLOOKUP(Equipes!$A25,'Detail Equipes'!$A:$V,18,FALSE),\"XX\")","v":"Arthur VAN SLOOTEN"},{"$f":"IFERROR(VLOOKUP(Equipes!$A25,'Detail Equipes'!$A:$V,22,FALSE),0)","v":53.303246198947235}]
[25,{"$f":"IFERROR(VLOOKUP(Equipes!$A26,'Detail Equipes'!$A:$V,21,FALSE),\"X\")","v":"M"},{"$f":"IFERROR(VLOOKUP(Equipes!$A26,'Detail Equipes'!$A:$V,3,FALSE),\"XX\")","v":"VILLENNES - POISSY AC 2"},{"$f":"IFERROR(VLOOKUP(Equipes!$A26,'Detail Equipes'!$A:$V,4,FALSE),\"XX\")","v":"ACVP2"},{"$f":"IFERROR(VLOOKUP(Equipes!$A26,'Detail Equipes'!$A:$V,6,FALSE),\"XX\")","v":"Franck CARIOU"},{"$f":"IFERROR(VLOOKUP(Equipes!$A26,'Detail Equipes'!$A:$V,9,FALSE),\"XX\")","v":"Michael LE BANNER"},{"$f":"IFERROR(VLOOKUP(Equipes!$A26,'Detail Equipes'!$A:$V,12,FALSE),\"XX\")","v":"Valerie DECAESTECKER"},{"$f":"IFERROR(VLOOKUP(Equipes!$A26,'Detail Equipes'!$A:$V,15,FALSE),\"XX\")","v":"Karine GUILBON"},{"$f":"IFERROR(VLOOKUP(Equipes!$A26,'Detail Equipes'!$A:$V,18,FALSE),\"XX\")","v":"Christophe ELINE"},{"$f":"IFERROR(VLOOKUP(Equipes!$A26,'Detail Equipes'!$A:$V,22,FALSE),0)","v":53.839684555111617}]
[26,{"$f":"IFERROR(VLOOKUP(Equipes!$A27,'Detail Equipes'!$A:$V,21,FALSE),\"X\")","v":"M"},{"$f":"IFERROR(VLOOKUP(Equipes!$A27,'Detail Equipes'!$A:$V,3,FALSE),\"XX\")","v":"EVRY SCA 1"},{"$f":"IFERROR(VLOOKUP(Equipes!$A27,'Detail Equipes'!$A:$V,4,FALSE),\"XX\")","v":"SCA 1"},{"$f":"IFERROR(VLOOKUP(Equipes!$A27,'Detail Equipes'!$A:$V,6,FALSE),\"XX\")","v":"Anne CARDUNER"},{"$f":"IFERROR(VLOOKUP(Equipes!$A27,'Detail Equipes'!$A:$V,9,FALSE),\"XX\")","v":"Olivia PEZZOLI"},{"$f":"IFERROR(VLOOKUP(Equipes!$A27,'Detail Equipes'!$A:$V,12,FALSE),\"XX\")","v":"Bruno CASIMIR"},{"$f":"IFERROR(VLOOKUP(Equipes!$A27,'Detail Equipes'!$A:$V,15,FALSE),\"XX\")","v":"Lionel BOISSONNAT"},{"$f":"IFERROR(VLOOKUP(Equipes!$A27,'Detail Equipes'!$A:$V,18,FALSE),\"XX\")","v":"Kristell MAUCHET"},{"$f":"IFERROR(VLOOKUP(Equipes!$A27,'Detail Equipes'!$A:$V,22,FALSE),0)","v":56.029821541412993}]
[27,{"$f":"IFERROR(VLOOKUP(Equipes!$A28,'Detail Equipes'!$A:$V,21,FALSE),\"X\")","v":"F"},{"$f":"IFERROR(VLOOKUP(Equipes!$A28,'Detail Equipes'!$A:$V,3,FALSE),\"XX\")","v":"MEULAN LES MUREAUX AMMH 1"},{"$f":"IFERROR(VLOOKUP(Equipes!$A28,'Detail Equipes'!$A:$V,4,FALSE),\"XX\")","v":"AMMH1"},{"$f":"IFERROR(VLOOKUP(Equipes!$A28,'Detail Equipes'!$A:$V,6,FALSE),\"XX\")","v":"Gwenaelle MARSAIS"},{"$f":"IFERROR(VLOOKUP(Equipes!$A28,'Detail Equipes'!$A:$V,9,FALSE),\"XX\")","v":"Sophie SEFFAR"},{"$f":"IFERROR(VLOOKUP(Equipes!$A28,'Detail Equipes'!$A:$V,12,FALSE),\"XX\")","v":"Catherine MARTINIER"},{"$f":"IFERROR(VLOOKUP(Equipes!$A28,'Detail Equipes'!$A:$V,15,FALSE),\"XX\")","v":"Christelle GOANVIC"},{"$f":"IFERROR(VLOOKUP(Equipes!$A28,'Detail Equipes'!$A:$V,18,FALSE),\"XX\")","v":"Marie LAMORE"},{"$f":"IFERROR(VLOOKUP(Equipes!$A28,'Detail Equipes'!$A:$V,22,FALSE),0)","v":46.899958527714368}]
[28,{"$f":"IFERROR(VLOOKUP(Equipes!$A29,'Detail Equipes'!$A:$V,21,FALSE),\"X\")","v":"M"},{"$f":"IFERROR(VLOOKUP(Equipes!$A29,'Detail Equipes'!$A:$V,3,FALSE),\"XX\")","v":"VILLENNES - POISSY AC 1"},{"$f":"IFERROR(VLOOKUP(Equipes!$A29,'Detail Equipes'!$A:$V,4,FALSE),\"XX\")","v":"ACVP1"},{"$f":"IFERROR(VLOOKUP(Equipes!$A29,'Detail Equipes'!$A:$V,6,FALSE),\"XX\")","v":"Frederic LE ROUX"},{"$f":"IFERROR(VLOOKUP(Equipes!$A29,'Detail Equipes'!$A:$V,9,FALSE),\"XX\")","v":"Corinne HUARD-ROLLAND"},{"$f":"IFERROR(VLOOKUP(Equipes!$A29,'Detail Equipes'!$A:$V,12,FALSE),\"XX\")","v":"Elodie DEREMIENCE"},{"$f":"IFERROR(VLOOKUP(Equipes!$A29,'Detail Equipes'!$A:$V,15,FALSE),\"XX\")","v":"Marie-Claude LAUNAY"},{"$f":"IFERROR(VLOOKUP(Equipes!$A29,'Detail Equipes'!$A:$V,18,FALSE),\"XX\")","v":"Olivier COSNEAU"},{"$f":"IFERROR(VLOOKUP(Equipes!$A29,'Detail Equipes'!$A:$V,22,FALSE),0)","v":52.863246198947238}]
[29,{"$f":"IFERROR(VLOOKUP(Equipes!$A30,'Detail Equipes'!$A:$V,21,FALSE),\"X\")","v":"H"},{"$f":"IFERROR(VLOOKUP(Equipes!$A30,'Detail Equipes'!$A:$V,3,FALSE),\"XX\")","v":"FONTAINEBLEAU APF 1"},{"$f":"IFERROR(VLOOKUP(Equipes!$A30,'Detail Equipes'!$A:$V,4,FALSE),\"XX\")","v":"APF1"},{"$f":"IFERROR(VLOOKUP(Equipes!$A30,'Detail Equipes'!$A:$V,6,FALSE),\"XX\")","v":"Kathleen SANCHEZ"},{"$f":"IFERROR(VLOOKUP(Equipes!$A30,'Detail Equipes'!$A:$V,9,FALSE),\"XX\")","v":"Laurent FOUQUE"},{"$f":"IFERROR(VLOOKUP(Equipes!$A30,'Detail Equipes'!$A:$V,12,FALSE),\"XX\")","v":"Christian MESSALES"},{"$f":"IFERROR(VLOOKUP(Equipes!$A30,'Detail Equipes'!$A:$V,15,FALSE),\"XX\")","v":"Denis FLORY"},{"$f":"IFERROR(VLOOKUP(Equipes!$A30,'Detail Equipes'!$A:$V,18,FALSE),\"XX\")","v":"David WEBER"},{"$f":"IFERROR(VLOOKUP(Equipes!$A30,'Detail Equipes'!$A:$V,22,FALSE),0)","v":57.463246198947239}]
[30,{"$f":"IFERROR(VLOOKUP(Equipes!$A31,'Detail Equipes'!$A:$V,21,FALSE),\"X\")","v":"H"},{"$f":"IFERROR(VLOOKUP(Equipes!$A31,'Detail Equipes'!$A:$V,3,FALSE),\"XX\")","v":"JOINVILLE AMJ 1"},{"$f":"IFERROR(VLOOKUP(Equipes!$A31,'Detail Equipes'!$A:$V,4,FALSE),\"XX\")","v":"AMJ1"},{"$f":"IFERROR(VLOOKUP(Equipes!$A31,'Detail Equipes'!$A:$V,6,FALSE),\"XX\")","v":"Vincent FABIEN"},{"$f":"IFERROR(VLOOKUP(Equipes!$A31,'Detail Equipes'!$A:$V,9,FALSE),\"XX\")","v":"Arnaud PUPPO"},{"$f":"IFERROR(VLOOKUP(Equipes!$A31,'Detail Equipes'!$A:$V,12,FALSE),\"XX\")","v":"Jonathan ROOKE"},{"$f":"IFERROR(VLOOKUP(Equipes!$A31,'Detail Equipes'!$A:$V,15,FALSE),\"XX\")","v":"Xavier SUCHET"},{"$f":"IFERROR(VLOOKUP(Equipes!$A31,'Detail Equipes'!$A:$V,18,FALSE),\"XX\")","v":"Nicolas JAMAULT"},{"$f":"IFERROR(VLOOKUP(Equipes!$A31,'Detail Equipes'!$A:$V,22,FALSE),0)","v":51.332287294837649}]
[31,{"$f":"IFERROR(VLOOKUP(Equipes!$A32,'Detail Equipes'!$A:$V,21,FALSE),\"X\")","v":"M"},{"$f":"IFERROR(VLOOKUP(Equipes!$A32,'Detail Equipes'!$A:$V,3,FALSE),\"XX\")","v":"NOGENT SUR MARNE CN 3"},{"$f":"IFERROR(VLOOKUP(Equipes!$A32,'Detail Equipes'!$A:$V,4,FALSE),\"XX\")","v":"CN3"},{"$f":"IFERROR(VLOOKUP(Equipes!$A32,'Detail Equipes'!$A:$V,6,FALSE),\"XX\")","v":"Alexandra COHEN SALMON"},{"$f":"IFERROR(VLOOKUP(Equipes!$A32,'Detail Equipes'!$A:$V,9,FALSE),\"XX\")","v":"Isabelle MILON-BANNEROT"},{"$f":"IFERROR(VLOOKUP(Equipes!$A32,'Detail Equipes'!$A:$V,12,FALSE),\"XX\")","v":"Jerome TROMBOFSKY"},{"$f":"IFERROR(VLOOKUP(Equipes!$A32,'Detail Equipes'!$A:$V,15,FALSE),\"XX\")","v":"Olivier PASCAL"},{"$f":"IFERROR(VLOOKUP(Equipes!$A32,'Detail Equipes'!$A:$V,18,FALSE),\"XX\")","v":"Elisabeth LAUNAY"},{"$f":"IFERROR(VLOOKUP(Equipes!$A32,'Detail Equipes'!$A:$V,22,FALSE),0)","v":52.881876335933534}]
[32,{"$f":"IFERROR(VLOOKUP(Equipes!$A33,'Detail Equipes'!$A:$V,21,FALSE),\"X\")","v":"H"},{"$f":"IFERROR(VLOOKUP(Equipes!$A33,'Detail Equipes'!$A:$V,3,FALSE),\"XX\")","v":"BOULOGNE 92 1"},{"$f":"IFERROR(VLOOKUP(Equipes!$A33,'Detail Equipes'!$A:$V,4,FALSE),\"XX\")","v":"ACBB1"},{"$f":"IFERROR(VLOOKUP(Equipes!$A33,'Detail Equipes'!$A:$V,6,FALSE),\"XX\")","v":"Isabelle MAIRE"},{"$f":"IFERROR(VLOOKUP(Equipes!$A33,'Detail Equipes'!$A:$V,9,FALSE),\"XX\")","v":"Théo BEL BERBEL- LURBE"},{"$f":"IFERROR(VLOOKUP(Equipes!$A33,'Detail Equipes'!$A:$V,12,FALSE),\"XX\")","v":"Thã‰Odore SEDAROS"},{"$f":"IFERROR(VLOOKUP(Equipes!$A33,'Detail Equipes'!$A:$V,15,FALSE),\"XX\")","v":"Omar OUAZZANI"},{"$f":"IFERROR(VLOOKUP(Equipes!$A33,'Detail Equipes'!$A:$V,18,FALSE),\"XX\")","v":"Alexandra MENEZES"},{"$f":"IFERROR(VLOOKUP(Equipes!$A33,'Detail Equipes'!$A:$V,22,FALSE),0)","v":42.811191404426694}]
[33,{"$f":"IFERROR(VLOOKUP(Equipes!$A34,'Detail Equipes'!$A:$V,21,FALSE),\"X\")","v":"X"},{"$f":"IFERROR(VLOOKUP(Equipes!$A34,'Detail Equipes'!$A:$V,3,FALSE),\"XX\")","v":"XX"},{"$f":"IFERROR(VLOOKUP(Equipes!$A34,'Detail Equipes'!$A:$V,4,FALSE),\"XX\")","v":"XX"},{"$f":"IFERROR(VLOOKUP(Equipes!$A34,'Detail Equipes'!$A:$V,6,FALSE),\"XX\")","v":"XX"},{"$f":"IFERROR(VLOOKUP(Equipes!$A34,'Detail Equipes'!$A:$V,9,FALSE),\"XX\")","v":"XX"},{"$f":"IFERROR(VLOOKUP(Equipes!$A34,'Detail Equipes'!$A:$V,12,FALSE),\"XX\")","v":"XX"},{"$f":"IFERROR(VLOOKUP(Equipes!$A34,'Detail Equipes'!$A:$V,15,FALSE),\"XX\")","v":"XX"},{"$f":"IFERROR(VLOOKUP(Equipes!$A34,'Detail Equipes'!$A:$V,18,FALSE),\"XX\")","v":"XX"},{"$f":"IFERROR(VLOOKUP(Equipes!$A34,'Detail Equipes'!$A:$V,22,FALSE),0)","v":0}]
[34,{"$f":"IFERROR(VLOOKUP(Equipes!$A35,'Detail Equipes'!$A:$V,21,FALSE),\"X\")","v":"X"},{"$f":"IFERROR(VLOOKUP(Equipes!$A35,'Detail Equipes'!$A:$V,3,FALSE),\"XX\")","v":"XX"},{"$f":"IFERROR(VLOOKUP(Equipes!$A35,'Detail Equipes'!$A:$V,4,FALSE),\"XX\")","v":"XX"},{"$f":"IFERROR(VLOOKUP(Equipes!$A35,'Detail Equipes'!$A:$V,6,FALSE),\"XX\")","v":"XX"},{"$f":"IFERROR(VLOOKUP(Equipes!$A35,'Detail Equipes'!$A:$V,9,FALSE),\"XX\")","v":"XX"},{"$f":"IFERROR(VLOOKUP(Equipes!$A35,'Detail Equipes'!$A:$V,12,FALSE),\"XX\")","v":"XX"},{"$f":"IFERROR(VLOOKUP(Equipes!$A35,'Detail Equipes'!$A:$V,15,FALSE),\"XX\")","v":"XX"},{"$f":"IFERROR(VLOOKUP(Equipes!$A35,'Detail Equipes'!$A:$V,18,FALSE),\"XX\")","v":"XX"},{"$f":"IFERROR(VLOOKUP(Equipes!$A35,'Detail Equipes'!$A:$V,22,FALSE),0)","v":0}]
[35,{"$f":"IFERROR(VLOOKUP(Equipes!$A36,'Detail Equipes'!$A:$V,21,FALSE),\"X\")","v":"X"},{"$f":"IFERROR(VLOOKUP(Equipes!$A36,'Detail Equipes'!$A:$V,3,FALSE),\"XX\")","v":"XX"},{"$f":"IFERROR(VLOOKUP(Equipes!$A36,'Detail Equipes'!$A:$V,4,FALSE),\"XX\")","v":"XX"},{"$f":"IFERROR(VLOOKUP(Equipes!$A36,'Detail Equipes'!$A:$V,6,FALSE),\"XX\")","v":"XX"},{"$f":"IFERROR(VLOOKUP(Equipes!$A36,'Detail Equipes'!$A:$V,9,FALSE),\"XX\")","v":"XX"},{"$f":"IFERROR(VLOOKUP(Equipes!$A36,'Detail Equipes'!$A:$V,12,FALSE),\"XX\")","v":"XX"},{"$f":"IFERROR(VLOOKUP(Equipes!$A36,'Detail Equipes'!$A:$V,15,FALSE),\"XX\")","v":"XX"},{"$f":"IFERROR(VLOOKUP(Equipes!$A36,'Detail Equipes'!$A:$V,18,FALSE),\"XX\")","v":"XX"},{"$f":"IFERROR(VLOOKUP(Equipes!$A36,'Detail Equipes'!$A:$V,22,FALSE),0)","v":0}]
[36,{"$f":"IFERROR(VLOOKUP(Equipes!$A37,'Detail Equipes'!$A:$V,21,FALSE),\"X\")","v":"X"},{"$f":"IFERROR(VLOOKUP(Equipes!$A37,'Detail Equipes'!$A:$V,3,FALSE),\"XX\")","v":"XX"},{"$f":"IFERROR(VLOOKUP(Equipes!$A37,'Detail Equipes'!$A:$V,4,FALSE),\"XX\")","v":"XX"},{"$f":"IFERROR(VLOOKUP(Equipes!$A37,'Detail Equipes'!$A:$V,6,FALSE),\"XX\")","v":"XX"},{"$f":"IFERROR(VLOOKUP(Equipes!$A37,'Detail Equipes'!$A:$V,9,FALSE),\"XX\")","v":"XX"},{"$f":"IFERROR(VLOOKUP(Equipes!$A37,'Detail Equipes'!$A:$V,12,FALSE),\"XX\")","v":"XX"},{"$f":"IFERROR(VLOOKUP(Equipes!$A37,'Detail Equipes'!$A:$V,15,FALSE),\"XX\")","v":"XX"},{"$f":"IFERROR(VLOOKUP(Equipes!$A37,'Detail Equipes'!$A:$V,18,FALSE),\"XX\")","v":"XX"},{"$f":"IFERROR(VLOOKUP(Equipes!$A37,'Detail Equipes'!$A:$V,22,FALSE),0)","v":0}]
[37,{"$f":"IFERROR(VLOOKUP(Equipes!$A38,'Detail Equipes'!$A:$V,21,FALSE),\"X\")","v":"X"},{"$f":"IFERROR(VLOOKUP(Equipes!$A38,'Detail Equipes'!$A:$V,3,FALSE),\"XX\")","v":"XX"},{"$f":"IFERROR(VLOOKUP(Equipes!$A38,'Detail Equipes'!$A:$V,4,FALSE),\"XX\")","v":"XX"},{"$f":"IFERROR(VLOOKUP(Equipes!$A38,'Detail Equipes'!$A:$V,6,FALSE),\"XX\")","v":"XX"},{"$f":"IFERROR(VLOOKUP(Equipes!$A38,'Detail Equipes'!$A:$V,9,FALSE),\"XX\")","v":"XX"},{"$f":"IFERROR(VLOOKUP(Equipes!$A38,'Detail Equipes'!$A:$V,12,FALSE),\"XX\")","v":"XX"},{"$f":"IFERROR(VLOOKUP(Equipes!$A38,'Detail Equipes'!$A:$V,15,FALSE),\"XX\")","v":"XX"},{"$f":"IFERROR(VLOOKUP(Equipes!$A38,'Detail Equipes'!$A:$V,18,FALSE),\"XX\")","v":"XX"},{"$f":"IFERROR(VLOOKUP(Equipes!$A38,'Detail Equipes'!$A:$V,22,FALSE),0)","v":0}]
[38,{"$f":"IFERROR(VLOOKUP(Equipes!$A39,'Detail Equipes'!$A:$V,21,FALSE),\"X\")","v":"X"},{"$f":"IFERROR(VLOOKUP(Equipes!$A39,'Detail Equipes'!$A:$V,3,FALSE),\"XX\")","v":"XX"},{"$f":"IFERROR(VLOOKUP(Equipes!$A39,'Detail Equipes'!$A:$V,4,FALSE),\"XX\")","v":"XX"},{"$f":"IFERROR(VLOOKUP(Equipes!$A39,'Detail Equipes'!$A:$V,6,FALSE),\"XX\")","v":"XX"},{"$f":"IFERROR(VLOOKUP(Equipes!$A39,'Detail Equipes'!$A:$V,9,FALSE),\"XX\")","v":"XX"},{"$f":"IFERROR(VLOOKUP(Equipes!$A39,'Detail Equipes'!$A:$V,12,FALSE),\"XX\")","v":"XX"},{"$f":"IFERROR(VLOOKUP(Equipes!$A39,'Detail Equipes'!$A:$V,15,FALSE),\"XX\")","v":"XX"},{"$f":"IFERROR(VLOOKUP(Equipes!$A39,'Detail Equipes'!$A:$V,18,FALSE),\"XX\")","v":"XX"},{"$f":"IFERROR(VLOOKUP(Equipes!$A39,'Detail Equipes'!$A:$V,22,FALSE),0)","v":0}]
[39,{"$f":"IFERROR(VLOOKUP(Equipes!$A40,'Detail Equipes'!$A:$V,21,FALSE),\"X\")","v":"X"},{"$f":"IFERROR(VLOOKUP(Equipes!$A40,'Detail Equipes'!$A:$V,3,FALSE),\"XX\")","v":"XX"},{"$f":"IFERROR(VLOOKUP(Equipes!$A40,'Detail Equipes'!$A:$V,4,FALSE),\"XX\")","v":"XX"},{"$f":"IFERROR(VLOOKUP(Equipes!$A40,'Detail Equipes'!$A:$V,6,FALSE),\"XX\")","v":"XX"},{"$f":"IFERROR(VLOOKUP(Equipes!$A40,'Detail Equipes'!$A:$V,9,FALSE),\"XX\")","v":"XX"},{"$f":"IFERROR(VLOOKUP(Equipes!$A40,'Detail Equipes'!$A:$V,12,FALSE),\"XX\")","v":"XX"},{"$f":"IFERROR(VLOOKUP(Equipes!$A40,'Detail Equipes'!$A:$V,15,FALSE),\"XX\")","v":"XX"},{"$f":"IFERROR(VLOOKUP(Equipes!$A40,'Detail Equipes'!$A:$V,18,FALSE),\"XX\")","v":"XX"},{"$f":"IFERROR(VLOOKUP(Equipes!$A40,'Detail Equipes'!$A:$V,22,FALSE),0)","v":0}]
[40,{"$f":"IFERROR(VLOOKUP(Equipes!$A41,'Detail Equipes'!$A:$V,21,FALSE),\"X\")","v":"X"},{"$f":"IFERROR(VLOOKUP(Equipes!$A41,'Detail Equipes'!$A:$V,3,FALSE),\"XX\")","v":"XX"},{"$f":"IFERROR(VLOOKUP(Equipes!$A41,'Detail Equipes'!$A:$V,4,FALSE),\"XX\")","v":"XX"},{"$f":"IFERROR(VLOOKUP(Equipes!$A41,'Detail Equipes'!$A:$V,6,FALSE),\"XX\")","v":"XX"},{"$f":"IFERROR(VLOOKUP(Equipes!$A41,'Detail Equipes'!$A:$V,9,FALSE),\"XX\")","v":"XX"},{"$f":"IFERROR(VLOOKUP(Equipes!$A41,'Detail Equipes'!$A:$V,12,FALSE),\"XX\")","v":"XX"},{"$f":"IFERROR(VLOOKUP(Equipes!$A41,'Detail Equipes'!$A:$V,15,FALSE),\"XX\")","v":"XX"},{"$f":"IFERROR(VLOOKUP(Equipes!$A41,'Detail Equipes'!$A:$V,18,FALSE),\"XX\")","v":"XX"},{"$f":"IFERROR(VLOOKUP(Equipes!$A41,'Detail Equipes'!$A:$V,22,FALSE),0)","v":0}]

{"sheet":"Detail Equipes","index":11,"n_rows":41,"n_cols":26,"rows_kept":41,"cut":false,"hidden":false,"merged":[]}
["N° bateau\n(tirage)","équipage N°","Club","Ville","nom du délégué","RAMEUR\n","DNA","AGE","RAMEUR","DNA","AGE","RAMEUR","DNA","AGE","RAMEUR\nBARREUR","DNA","AGE","RAMEUR\nBARREUR","DNA","AGE","Type","Age moyen","2022-06-12"]
[1,2,"ANDRESY CA CONFLUENT 1","Cac1","Nathalie BOURGEOIS","Stephanie LAPORTE",null,null,"Marine NACERI",null,null,"Marc LACCASSAGNE",null,null,"Stephane ZETTWOOG",null,null,"Fouzia VOIRIN",null,null,"M",49.431465377029433]
[2,8,"CAUDEBEC EN CAUX ACVS 1","Caudebec","Nicolas BARRAY","Martine NARBAIS-JAUREGUY",null,null,"Caroline KERVRANN",null,null,"Stephane DELAMARE",null,null,"Nicolas BARRAY",null,null,"Francois NARBAIS-JAUREGUY",null,null,"M",55.146533870180107,null,null,{"$f":"+COUNTIF($U$2:$U$43,Z3)","v":19},"M"]
[3,4,"ANDRESY CA CONFLUENT 2","CAC 2","Nathalie BOURGEOIS","Anna ALCALOIDEPOIXBLANC",null,null,"Geoffrey GHIZZONI",null,null,"Nathalie BOURGEOIS",null,null,"Franck CHRISTIANNOT",null,null,"NicOLAS delaunoy",null,null,"M",55.448451678399294,null,null,{"$f":"+COUNTIF($U$2:$U$43,Z4)","v":2},"F"]
[4,3,"ANDRESY CA CONFLUENT 1","CAC3","Nathalie BOURGEOIS","Emmanuel SALIN",null,null,"Ousseni PARKOUDA",null,null,"Jean-Baptiste PROVENZANO",null,null,"Jerome CLAVE",null,null,"Julian GALLELA",null,null,"H",45.693931130454089,null,null,12,"H"]
[5,24,"PORT-MARLY RC 1","RCPM","Vincent BONTOUX","Claudie BODIN",null,null,"Fanny LAMOUR",null,null,"Etienne DUPUIS",null,null,"Jeancharles FAUCHEUX",null,null,"Gildas KETTANJIAN",null,null,"M",50.43420510305684,null,"Total",{"$f":"+SUM(Y3:Y5)","v":33}]
[6,7,"BOULOGNE 92 2","ACBB","Christian GAIGNARD","CéLia ROUSSELLE",null,null,"Marie Pierre MARSALLON GAMBY",null,null,"Françis ROBIN",null,null,"Nicolas LECOEUR",null,null,"Theodora XENOGIANI",null,null,"M",45.90927359620752]
[7,33,"VILLENNES - POISSY AC 3","ACVP","Frederic LE ROUX","Virginie ALEXANDRE",null,null,"Jihad LEMARQRI",null,null,"Cyrille BRUZON-BASCOU",null,null,"Sebastien CARPENTIER",null,null,"Marie Estelle D'ARBAUMONT",null,null,"M",48.766807842782853]
[8,13,"JOINVILLE AMJ 1","Joinville","Servane HEUDIARD","Laurent BAUDOIN",null,null,"Raphaelle BOUVIER FLORY",null,null,"Sophie BUSTOS",null,null,"Kastriot JAKA",null,null,"Thomas AUGER",null,null,"M",46.081328390728068]
[9,19,"NOGENT SUR MARNE CN 1","CN 1","Caroline PIEDNOIRE","Chrystelle SUPIOT",null,null,"Caroline PIEDNOIRE",null,null,"Olivier MUCIGNAT",null,null,"Andre SIMONNET",null,null,"Fabienne LORTIE",null,null,"M",53.262150308536278]
[10,20,"NOGENT SUR MARNE CN 2","CN2","Caroline PIEDNOIRE","Christophe RUCKEBUSCH",null,null,"Nicolas BURCKHART",null,null,"Alice GHEERBRANT",null,null,"Aurelie DONVAL",null,null,"Gerard LECA",null,null,"M",52.515848938673265]
[11,5,"BOULOGNE 92 1","ACBB","Christian GAIGNARD","Viviane BALLOY",null,null,"Timothé BAZIRIES",null,null,"Alexandre LE FUR",null,null,"Sigrid PABST",null,null,"Michel VEDRINE",null,null,"H",50.552013322234913]
[12,11,"EVRY SCA 2","SCA2","Frederic DUCAUQUY","Laurent YEBOAH",null,null,"Isabelle MOISSET FLEURISSON",null,null,"Frederic DUCAUQUY",null,null,"Sandrine GARCIA",null,null,"Christelle MARTIN",null,null,"M",47.962972226344498]
[13,26,"PORT-MARLY RC 2","RCPM2","Vincent BONTOUX","Elsa CROZATIER",null,null,"Cyrielle BERTHIER",null,null,"Hervé Valette",null,null,"Eric MOINARD",null,null,"Anais FEUGA",null,null,"M",46.709821541413007]
[14,15,"MAISONS MESNIL CERAMM 1","CERAMM1","Alain GIRARD","Nicolas SCHMITT",null,null,"Gloria VENDRELL",null,null,"Christine MARIE LAVAUD",null,null,"Amaury DE LA LAURENCIE",null,null,"Amina ELABBADI",null,null,"M",50.254479075659567]
[15,29,"SOISY SUR SEINE CN 1","CN1","Bertrand PIOGER","Bertrand PIOGER",null,null,"Bruno PERIQUOI",null,null,"Servane BERTRAND",null,null,"Alain BERNARD",null,null,"Robert TRAUET",null,null,"H",54.245164007166423]
[16,23,"PORT-MARLY RC 1","RCPM1","Vincent BONTOUX","Jean-Claude LAFOREST",null,null,"David CHARTIER",null,null,"Christophe MARCAIS",null,null,"Vincent BONTOUX",null,null,"Alain ROUSSEAU",null,null,"H",54.613931130454091]
[17,1,"ANDRESY CA CONFLUENT 1","CAC1","Nathalie BOURGEOIS","Daphne PARIZOT",null,null,"Agnes BURGHGRAEVE SELLEN",null,null,"Sylvie FRANSSEN",null,null,"Severine LEGAILLARD",null,null,"Martine LE ROUX",null,null,"F",55.086259897577371]
[18,16,"MAISONS MESNIL CERAMM 2","CERAMM2","Alain GIRARD","Claude LEMENAGER",null,null,"Didier GIRARDEAU",null,null,"Laurent LIBOTTE",null,null,"Alain GIRARD",null,null,"Cecile JEAMMES",null,null,"H",58.073109212645861]
[19,31,"VILLENNES - POISSY AC 1","ACVP1","Frederic LE ROUX","Olivier POLGE",null,null,"Odile POLGE",null,null,"Laurent BONHOMMET",null,null,"Antoine VOLPI",null,null,"Philippe STROHM",null,null,"H",55.204068116755458]
[20,27,"ROUEN CNAR 1","CNAR1","Francois LAIR","Nathalie MOUSSET",null,null,"Francois LAIR",null,null,"Betty GESLAIN",null,null,"Thierry DUCHESNE",null,null,"Stephane MOUSSET",null,null,"M",55.385985924974634]
[21,25,"PORT-MARLY RC 2","RCPM2","Vincent BONTOUX","Guillaume CHARRON",null,null,"Philippe VERHE",null,null,"Stephan REYNIER",null,null,"Dominique LEROUX",null,null,"Luciano AUTUNNALE",null,null,"H",50.87475304826232]
[22,9,"COUDRAY MONTCEAUX A 1","coudray1","Pascal BEAUSSART","Joseph RAYNAUD",null,null,"Frederic MORAT",null,null,"Benjamin HOUILLON",null,null,"Pascal BEAUSSART",null,null,"Anne HOUAL",null,null,"H",51.871465377029423]
[23,28,"SN OISE 1","SN Oise 1\n","Nathalie BAUDIER","Agnes AUDEBERT",null,null,"Nicolas RAUCH",null,null,"Jerome ROUGE",null,null,"Nathalie BAUDIER",null,null,"Isabelle JOUBERT",null,null,"M",49.531739349632183]
[24,17,"MEULAN LES MUREAUX AMMH 1","AMMH1","Franck DUCHAT","Xavier MARSAIS",null,null,"Eric PRENEY",null,null,"Yannick DAGMEY",null,null,"David COINE",null,null,"Arthur VAN SLOOTEN",null,null,"H",53.303246198947235]
[25,32,"VILLENNES - POISSY AC 2","ACVP2","Frederic LE ROUX","Franck CARIOU",null,null,"Michael LE BANNER",null,null,"Valerie DECAESTECKER",null,null,"Karine GUILBON",null,null,"Christophe ELINE",null,null,"M",53.839684555111617]
[26,10,"EVRY SCA 1","SCA 1","Frederic DUCAUQUY","Anne CARDUNER",null,null,"Olivia PEZZOLI",null,null,"Bruno CASIMIR",null,null,"Lionel BOISSONNAT",null,null,"Kristell MAUCHET",null,null,"M",56.029821541412993]
[27,18,"MEULAN LES MUREAUX AMMH 1","AMMH1","Franck DUCHAT","Gwenaelle MARSAIS",null,null,"Sophie SEFFAR",null,null,"Catherine MARTINIER",null,null,"Christelle GOANVIC",null,null,"Marie LAMORE",null,null,"F",46.899958527714368]
[28,30,"VILLENNES - POISSY AC 1","ACVP1","Frederic LE ROUX","Frederic LE ROUX",null,null,"Corinne HUARD-ROLLAND",null,null,"Elodie DEREMIENCE",null,null,"Marie-Claude LAUNAY",null,null,"Olivier COSNEAU",null,null,"M",52.863246198947238]
[29,12,"FONTAINEBLEAU APF 1","APF1","Gerard CLEMESSY","Kathleen SANCHEZ",null,null,"Laurent FOUQUE",null,null,"Christian MESSALES",null,null,"Denis FLORY",null,null,"David WEBER",null,null,"H",57.463246198947239]
[30,14,"JOINVILLE AMJ 1","AMJ1","Servane HEUDIARD","Vincent FABIEN",null,null,"Arnaud PUPPO",null,null,"Jonathan ROOKE",null,null,"Xavier SUCHET",null,null,"Nicolas JAMAULT",null,null,"H",51.332287294837649]
[31,21,"NOGENT SUR MARNE CN 3","CN3","Caroline PIEDNOIRE","Alexandra COHEN SALMON",null,null,"Isabelle MILON-BANNEROT",null,null,"Jerome TROMBOFSKY",null,null,"Olivier PASCAL",null,null,"Elisabeth LAUNAY",null,null,"M",52.881876335933534]
[32,6,"BOULOGNE 92 1","ACBB1","Christian GAIGNARD","Isabelle MAIRE",null,null,"Théo BEL BERBEL- LURBE",null,null,"Thã‰Odore SEDAROS",null,null,"Omar OUAZZANI",null,null,"Alexandra MENEZES",null,null,"H",42.811191404426694]
[null,33,{"$f":"[2]FFA_Inscriptions!$E39","v":"VILLENNES - POISSY AC 3"},"ACVP3",{"$f":"PROPER([2]FFA_Inscriptions!$EI39)&\" \"&[2]FFA_Inscriptions!$EH39","v":"Frederic LE ROUX"},{"$f":"PROPER([2]FFA_Inscriptions!$G39) & \" \" & [2]FFA_Inscriptions!$F39","v":"Virginie ALEXANDRE"},null,null,{"$f":"PROPER([2]FFA_Inscriptions!$S39)&\" \" &[2]FFA_Inscriptions!$R39","v":"Jihad LEMARQRI"},null,null,{"$f":"PROPER([2]FFA_Inscriptions!$AE39)&\" \" &[2]FFA_Inscriptions!$AD39","v":"Cyrille BRUZON-BASCOU"},null,null,{"$f":"PROPER([2]FFA_Inscriptions!$AQ39)&\" \"&[2]FFA_Inscriptions!$AP39","v":"Sebastien CARPENTIER"},null,null,{"$f":"PROPER([2]FFA_Inscriptions!$CY39)&\" \"&[2]FFA_Inscriptions!$CX39","v":"Marie Estelle D'ARBAUMONT"},null,null,"M",{"$f":"AVERAGE(H34,K34,N34,Q34,T34)","v":{"$error":"#DIV/0!"}}]
[null,34]
[null,35]
[null,36]
[null,37]
[null,38]
[null,39]
[null,40]

{"sheet":"TEMPS-ponton","index":12,"n_rows":48,"n_cols":13,"rows_kept":48,"cut":false,"hidden":false,"merged":[[1,6,1,8],[0,6,0,8],[0,3,1,5],[0,0,1,2]]}
["GRAND 8",null,null,{"$f":"'Note explicative fichier'!E3","v":"2024-06-02"},null,null,"Intervalle de départ des yolettes ",null,null,"00:02:30"]
[null,null,null,null,null,null,"Nombre de \nYolettes",null,null,{"$f":"+Equipes!N5","v":32}]
["Yolette N°","Club","Ville","Equipe","Classe","Moy. Age","Départ","1 / 4\nG-8","1 / 2\nG-8","3 / 4\nG-8","Arrivée","Temps de course","Delta Record"]
["Record","POLYTECHNIQUE ( Référence 2012 )","Palaiseau","FERRERO Michel - Alexandre Rosinski - BOYAUD Mathieu - GODDE Olivier - THECKES Benoit","M",null,"08:46:30","09:10:05","09:27:11","09:51:04","10:08:18",{"$f":"+K4-G4","v":"01:21:48"},"00:00:00"]
[{"$f":"Equipes!A2","v":1},{"$f":"Equipes!C2","v":"ANDRESY CA CONFLUENT 1"},{"$f":"Equipes!D2","v":"Cac1"},{"$f":"CONCATENATE(Equipes!E2,Equipes!$L$3,Equipes!F2,Equipes!$L$3,Equipes!G2,Equipes!$L$3,Equipes!H2,Equipes!$L$3,Equipes!I2)","v":"Stephanie LAPORTE-Marine NACERI-Marc LACCASSAGNE-Stephane ZETTWOOG-Fouzia VOIRIN"},{"$f":"VLOOKUP(A5,Equipes!A:J,2,FALSE)","v":"M"},{"$f":"ROUND(VLOOKUP(A5,Equipes!$A$2:$J$41,10,0),0)","v":49},"09:15:43","09:49:03","10:13:40","10:43:29","11:07:36",{"$f":"IF(+K5-G5>0,+K5-G5,\"99:99:99\")","v":"01:51:53"},{"$f":"+L5-$L$4","v":"00:30:05"}]
[{"$f":"Equipes!A3","v":2},{"$f":"Equipes!C3","v":"CAUDEBEC EN CAUX ACVS 1"},{"$f":"Equipes!D3","v":"Caudebec"},{"$f":"CONCATENATE(Equipes!E3,Equipes!$L$3,Equipes!F3,Equipes!$L$3,Equipes!G3,Equipes!$L$3,Equipes!H3,Equipes!$L$3,Equipes!I3)","v":"Martine NARBAIS-JAUREGUY-Caroline KERVRANN-Stephane DELAMARE-Nicolas BARRAY-Francois NARBAIS-JAUREGUY"},{"$f":"VLOOKUP(A6,Equipes!A:J,2,FALSE)","v":"M"},{"$f":"ROUND(VLOOKUP(A6,Equipes!$A$2:$J$41,10,0),0)","v":55},"09:18:40","09:48:48","10:11:02","10:40:10","11:02:27","01:43:47","00:21:59"]
[{"$f":"Equipes!A4","v":3},{"$f":"Equipes!C4","v":"ANDRESY CA CONFLUENT 2"},{"$f":"Equipes!D4","v":"CAC 2"},{"$f":"CONCATENATE(Equipes!E4,Equipes!$L$3,Equipes!F4,Equipes!$L$3,Equipes!G4,Equipes!$L$3,Equipes!H4,Equipes!$L$3,Equipes!I4)","v":"Anna ALCALOIDEPOIXBLANC-Geoffrey GHIZZONI-Nathalie BOURGEOIS-Franck CHRISTIANNOT-NicOLAS delaunoy"},"M",{"$f":"ROUND(VLOOKUP(A7,Equipes!$A$2:$J$41,10,0),0)","v":55},"09:20:40","09:54:28","10:21:29","10:52:53","11:18:29","01:57:49","00:36:01"]
[{"$f":"Equipes!A5","v":4},{"$f":"Equipes!C5","v":"ANDRESY CA CONFLUENT 1"},{"$f":"Equipes!D5","v":"CAC3"},{"$f":"CONCATENATE(Equipes!E5,Equipes!$L$3,Equipes!F5,Equipes!$L$3,Equipes!G5,Equipes!$L$3,Equipes!H5,Equipes!$L$3,Equipes!I5)","v":"Emmanuel SALIN-Ousseni PARKOUDA-Jean-Baptiste PROVENZANO-Jerome CLAVE-Julian GALLELA"},{"$f":"VLOOKUP(A8,Equipes!A:J,2,FALSE)","v":"H"},{"$f":"ROUND(VLOOKUP(A8,Equipes!$A$2:$J$41,10,0),0)","v":46},"09:22:41","09:52:26","10:16:29","10:45:27","11:10:08","01:47:27","00:25:39"]
[{"$f":"Equipes!A6","v":5},{"$f":"Equipes!C6","v":"PORT-MARLY RC 1"},{"$f":"Equipes!D6","v":"RCPM"},{"$f":"CONCATENATE(Equipes!E6,Equipes!$L$3,Equipes!F6,Equipes!$L$3,Equipes!G6,Equipes!$L$3,Equipes!H6,Equipes!$L$3,Equipes!I6)","v":"Claudie BODIN-Fanny LAMOUR-Etienne DUPUIS-Jeancharles FAUCHEUX-Gildas KETTANJIAN"},{"$f":"VLOOKUP(A9,Equipes!A:J,2,FALSE)","v":"M"},{"$f":"ROUND(VLOOKUP(A9,Equipes!$A$2:$J$41,10,0),0)","v":50},"09:24:40","09:55:08","10:19:14","10:49:38","11:13:52","01:49:12","00:27:24"]
[{"$f":"Equipes!A7","v":6},{"$f":"Equipes!C7","v":"BOULOGNE 92 2"},{"$f":"Equipes!D7","v":"ACBB"},{"$f":"CONCATENATE(Equipes!E7,Equipes!$L$3,Equipes!F7,Equipes!$L$3,Equipes!G7,Equipes!$L$3,Equipes!H7,Equipes!$L$3,Equipes!I7)","v":"CéLia ROUSSELLE-Marie Pierre MARSALLON GAMBY-Françis ROBIN-Nicolas LECOEUR-Theodora XENOGIANI"},{"$f":"VLOOKUP(A10,Equipes!A:J,2,FALSE)","v":"M"},{"$f":"ROUND(VLOOKUP(A10,Equipes!$A$2:$J$41,10,0),0)","v":46},"09:26:31","09:55:00","10:17:12","10:44:58","11:06:14","01:39:43","00:17:55"]
[{"$f":"Equipes!A8","v":7},{"$f":"Equipes!C8","v":"VILLENNES - POISSY AC 3"},{"$f":"Equipes!D8","v":"ACVP"},{"$f":"CONCATENATE(Equipes!E8,Equipes!$L$3,Equipes!F8,Equipes!$L$3,Equipes!G8,Equipes!$L$3,Equipes!H8,Equipes!$L$3,Equipes!I8)","v":"Virginie ALEXANDRE-Jihad LEMARQRI-Cyrille BRUZON-BASCOU-Sebastien CARPENTIER-Marie Estelle D'ARBAUMONT"},{"$f":"VLOOKUP(A11,Equipes!A:J,2,FALSE)","v":"M"},{"$f":"ROUND(VLOOKUP(A11,Equipes!$A$2:$J$41,10,0),0)","v":49},"09:28:10","09:56:55","10:19:37","10:47:30","11:09:39","01:41:29","00:19:41"]
[{"$f":"Equipes!A9","v":8},{"$f":"Equipes!C9","v":"JOINVILLE AMJ 1"},{"$f":"Equipes!D9","v":"Joinville"},{"$f":"CONCATENATE(Equipes!E9,Equipes!$L$3,Equipes!F9,Equipes!$L$3,Equipes!G9,Equipes!$L$3,Equipes!H9,Equipes!$L$3,Equipes!I9)","v":"Laurent BAUDOIN-Raphaelle BOUVIER FLORY-Sophie BUSTOS-Kastriot JAKA-Thomas AUGER"},{"$f":"VLOOKUP(A12,Equipes!A:J,2,FALSE)","v":"M"},{"$f":"ROUND(VLOOKUP(A12,Equipes!$A$2:$J$41,10,0),0)","v":46},"09:30:20","09:57:55","10:18:25","10:44:03","11:03:52","01:33:32","00:11:44"]
[{"$f":"Equipes!A10","v":9},{"$f":"Equipes!C10","v":"NOGENT SUR MARNE CN 1"},{"$f":"Equipes!D10","v":"CN 1"},{"$f":"CONCATENATE(Equipes!E10,Equipes!$L$3,Equipes!F10,Equipes!$L$3,Equipes!G10,Equipes!$L$3,Equipes!H10,Equipes!$L$3,Equipes!I10)","v":"Chrystelle SUPIOT-Caroline PIEDNOIRE-Olivier MUCIGNAT-Andre SIMONNET-Fabienne LORTIE"},{"$f":"VLOOKUP(A13,Equipes!A:J,2,FALSE)","v":"M"},{"$f":"ROUND(VLOOKUP(A13,Equipes!$A$2:$J$41,10,0),0)","v":53},"09:32:19","10:01:07","10:22:41","10:51:58","11:15:55","01:43:36","00:21:48"]
[{"$f":"Equipes!A11","v":10},{"$f":"Equipes!C11","v":"NOGENT SUR MARNE CN 2"},{"$f":"Equipes!D11","v":"CN2"},{"$f":"CONCATENATE(Equipes!E11,Equipes!$L$3,Equipes!F11,Equipes!$L$3,Equipes!G11,Equipes!$L$3,Equipes!H11,Equipes!$L$3,Equipes!I11)","v":"Christophe RUCKEBUSCH-Nicolas BURCKHART-Alice GHEERBRANT-Aurelie DONVAL-Gerard LECA"},{"$f":"VLOOKUP(A14,Equipes!A:J,2,FALSE)","v":"M"},{"$f":"ROUND(VLOOKUP(A14,Equipes!$A$2:$J$41,10,0),0)","v":53},"09:34:19","10:01:33","10:22:04","10:49:45","11:11:13","01:36:54","00:15:06"]
[{"$f":"Equipes!A12","v":11},{"$f":"Equipes!C12","v":"BOULOGNE 92 1"},{"$f":"Equipes!D12","v":"ACBB"},{"$f":"CONCATENATE(Equipes!E12,Equipes!$L$3,Equipes!F12,Equipes!$L$3,Equipes!G12,Equipes!$L$3,Equipes!H12,Equipes!$L$3,Equipes!I12)","v":"Viviane BALLOY-Timothé BAZIRIES-Alexandre LE FUR-Sigrid PABST-Michel VEDRINE"},{"$f":"VLOOKUP(A15,Equipes!A:J,2,FALSE)","v":"H"},{"$f":"ROUND(VLOOKUP(A15,Equipes!$A$2:$J$41,10,0),0)","v":51},"09:36:20","10:06:27","10:31:00","10:02:15","11:27:15","01:50:55","00:29:07"]
[{"$f":"Equipes!A13","v":12},{"$f":"Equipes!C13","v":"EVRY SCA 2"},{"$f":"Equipes!D13","v":"SCA2"},{"$f":"CONCATENATE(Equipes!E13,Equipes!$L$3,Equipes!F13,Equipes!$L$3,Equipes!G13,Equipes!$L$3,Equipes!H13,Equipes!$L$3,Equipes!I13)","v":"Laurent YEBOAH-Isabelle MOISSET FLEURISSON-Frederic DUCAUQUY-Sandrine GARCIA-Christelle MARTIN"},{"$f":"VLOOKUP(A16,Equipes!A:J,2,FALSE)","v":"M"},{"$f":"ROUND(VLOOKUP(A16,Equipes!$A$2:$J$41,10,0),0)","v":48},"09:38:19","10:04:33","10:24:42","10:50:34","11:10:12","01:31:53","00:10:05"]
[{"$f":"Equipes!A14","v":13},{"$f":"Equipes!C14","v":"PORT-MARLY RC 2"},{"$f":"Equipes!D14","v":"RCPM2"},{"$f":"CONCATENATE(Equipes!E14,Equipes!$L$3,Equipes!F14,Equipes!$L$3,Equipes!G14,Equipes!$L$3,Equipes!H14,Equipes!$L$3,Equipes!I14)","v":"Elsa CROZATIER-Cyrielle BERTHIER-Hervé Valette-Eric MOINARD-Anais FEUGA"},{"$f":"VLOOKUP(A17,Equipes!A:J,2,FALSE)","v":"M"},{"$f":"ROUND(VLOOKUP(A17,Equipes!$A$2:$J$41,10,0),0)","v":47},"09:40:21","10:05:55","10:26:06","10:51:36","11:12:20","01:31:59","00:10:11"]
[{"$f":"Equipes!A15","v":14},{"$f":"Equipes!C15","v":"MAISONS MESNIL CERAMM 1"},{"$f":"Equipes!D15","v":"CERAMM1"},{"$f":"CONCATENATE(Equipes!E15,Equipes!$L$3,Equipes!F15,Equipes!$L$3,Equipes!G15,Equipes!$L$3,Equipes!H15,Equipes!$L$3,Equipes!I15)","v":"Nicolas SCHMITT-Gloria VENDRELL-Christine MARIE LAVAUD-Amaury DE LA LAURENCIE-Amina ELABBADI"},{"$f":"VLOOKUP(A18,Equipes!A:J,2,FALSE)","v":"M"},{"$f":"ROUND(VLOOKUP(A18,Equipes!$A$2:$J$41,10,0),0)","v":50},"09:42:29","10:10:57","10:32:21","11:01:44","11:24:44","01:42:15","00:20:27"]
[{"$f":"Equipes!A16","v":15},{"$f":"Equipes!C16","v":"SOISY SUR SEINE CN 1"},{"$f":"Equipes!D16","v":"CN1"},{"$f":"CONCATENATE(Equipes!E16,Equipes!$L$3,Equipes!F16,Equipes!$L$3,Equipes!G16,Equipes!$L$3,Equipes!H16,Equipes!$L$3,Equipes!I16)","v":"Bertrand PIOGER-Bruno PERIQUOI-Servane BERTRAND-Alain BERNARD-Robert TRAUET"},{"$f":"VLOOKUP(A19,Equipes!A:J,2,FALSE)","v":"H"},{"$f":"ROUND(VLOOKUP(A19,Equipes!$A$2:$J$41,10,0),0)","v":54},"09:44:28","10:11:53","10:31:35","10:57:19","11:18:36","01:34:08","00:12:20"]
[{"$f":"Equipes!A17","v":16},{"$f":"Equipes!C17","v":"PORT-MARLY RC 1"},{"$f":"Equipes!D17","v":"RCPM1"},{"$f":"CONCATENATE(Equipes!E17,Equipes!$L$3,Equipes!F17,Equipes!$L$3,Equipes!G17,Equipes!$L$3,Equipes!H17,Equipes!$L$3,Equipes!I17)","v":"Jean-Claude LAFOREST-David CHARTIER-Christophe MARCAIS-Vincent BONTOUX-Alain ROUSSEAU"},{"$f":"VLOOKUP(A20,Equipes!A:J,2,FALSE)","v":"H"},{"$f":"ROUND(VLOOKUP(A20,Equipes!$A$2:$J$41,10,0),0)","v":55},"09:46:29","10:11:35","10:30:25","10:53:33","11:11:54","01:25:25","00:03:37"]
[{"$f":"Equipes!A18","v":17},{"$f":"Equipes!C18","v":"ANDRESY CA CONFLUENT 1"},{"$f":"Equipes!D18","v":"CAC1"},{"$f":"CONCATENATE(Equipes!E18,Equipes!$L$3,Equipes!F18,Equipes!$L$3,Equipes!G18,Equipes!$L$3,Equipes!H18,Equipes!$L$3,Equipes!I18)","v":"Daphne PARIZOT-Agnes BURGHGRAEVE SELLEN-Sylvie FRANSSEN-Severine LEGAILLARD-Martine LE ROUX"},{"$f":"VLOOKUP(A21,Equipes!A:J,2,FALSE)","v":"F"},{"$f":"ROUND(VLOOKUP(A21,Equipes!$A$2:$J$41,10,0),0)","v":55},"09:48:01","10:21:59","10:47:41","11:22:02","11:49:11","02:01:10","00:39:22"]
[{"$f":"Equipes!A19","v":18},{"$f":"Equipes!C19","v":"MAISONS MESNIL CERAMM 2"},{"$f":"Equipes!D19","v":"CERAMM2"},{"$f":"CONCATENATE(Equipes!E19,Equipes!$L$3,Equipes!F19,Equipes!$L$3,Equipes!G19,Equipes!$L$3,Equipes!H19,Equipes!$L$3,Equipes!I19)","v":"Claude LEMENAGER-Didier GIRARDEAU-Laurent LIBOTTE-Alain GIRARD-Cecile JEAMMES"},{"$f":"VLOOKUP(A22,Equipes!A:J,2,FALSE)","v":"H"},{"$f":"ROUND(VLOOKUP(A22,Equipes!$A$2:$J$41,10,0),0)","v":58},"09:50:59","10:19:49","10:42:08","11:10:30","11:32:37","01:41:38","00:19:50"]
[{"$f":"Equipes!A20","v":19},{"$f":"Equipes!C20","v":"VILLENNES - POISSY AC 1"},{"$f":"Equipes!D20","v":"ACVP1"},{"$f":"CONCATENATE(Equipes!E20,Equipes!$L$3,Equipes!F20,Equipes!$L$3,Equipes!G20,Equipes!$L$3,Equipes!H20,Equipes!$L$3,Equipes!I20)","v":"Olivier POLGE-Odile POLGE-Laurent BONHOMMET-Antoine VOLPI-Philippe STROHM"},{"$f":"VLOOKUP(A23,Equipes!A:J,2,FALSE)","v":"H"},{"$f":"ROUND(VLOOKUP(A23,Equipes!$A$2:$J$41,10,0),0)","v":55},"09:53:00","10:22:56","10:45:02","11:12:47","11:33:56",{"$f":"IF(+K23-G23>0,+K23-G23,\"99:99:99\")","v":"01:40:56"},"00:19:08"]
[{"$f":"Equipes!A21","v":20},{"$f":"Equipes!C21","v":"ROUEN CNAR 1"},{"$f":"Equipes!D21","v":"CNAR1"},{"$f":"CONCATENATE(Equipes!E21,Equipes!$L$3,Equipes!F21,Equipes!$L$3,Equipes!G21,Equipes!$L$3,Equipes!H21,Equipes!$L$3,Equipes!I21)","v":"Nathalie MOUSSET-Francois LAIR-Betty GESLAIN-Thierry DUCHESNE-Stephane MOUSSET"},{"$f":"VLOOKUP(A24,Equipes!A:J,2,FALSE)","v":"M"},{"$f":"ROUND(VLOOKUP(A24,Equipes!$A$2:$J$41,10,0),0)","v":55},"09:55:00","10:23:53","10:45:41","11:12:10","11:32:13",{"$f":"IF(+K24-G24>0,+K24-G24,\"99:99:99\")","v":"01:37:13"},"00:15:25"]
[{"$f":"Equipes!A22","v":21},{"$f":"Equipes!C22","v":"PORT-MARLY RC 2"},{"$f":"Equipes!D22","v":"RCPM2"},{"$f":"CONCATENATE(Equipes!E22,Equipes!$L$3,Equipes!F22,Equipes!$L$3,Equipes!G22,Equipes!$L$3,Equipes!H22,Equipes!$L$3,Equipes!I22)","v":"Guillaume CHARRON-Philippe VERHE-Stephan REYNIER-Dominique LEROUX-Luciano AUTUNNALE"},{"$f":"VLOOKUP(A25,Equipes!A:J,2,FALSE)","v":"H"},{"$f":"ROUND(VLOOKUP(A25,Equipes!$A$2:$J$41,10,0),0)","v":51},"09:57:00","10:22:28","10:43:04","11:08:43","11:28:40","01:31:40","00:09:52"]
[{"$f":"Equipes!A23","v":22},{"$f":"Equipes!C23","v":"COUDRAY MONTCEAUX A 1"},{"$f":"Equipes!D23","v":"coudray1"},{"$f":"CONCATENATE(Equipes!E23,Equipes!$L$3,Equipes!F23,Equipes!$L$3,Equipes!G23,Equipes!$L$3,Equipes!H23,Equipes!$L$3,Equipes!I23)","v":"Joseph RAYNAUD-Frederic MORAT-Benjamin HOUILLON-Pascal BEAUSSART-Anne HOUAL"},{"$f":"VLOOKUP(A26,Equipes!A:J,2,FALSE)","v":"H"},{"$f":"ROUND(VLOOKUP(A26,Equipes!$A$2:$J$41,10,0),0)","v":52},"09:59:00","10:28:10","10:50:40","11:18:43","11:40:46","01:41:46","00:19:58"]
[{"$f":"Equipes!A24","v":23},{"$f":"Equipes!C24","v":"SN OISE 1"},{"$f":"Equipes!D24","v":"SN Oise 1\n"},{"$f":"CONCATENATE(Equipes!E24,Equipes!$L$3,Equipes!F24,Equipes!$L$3,Equipes!G24,Equipes!$L$3,Equipes!H24,Equipes!$L$3,Equipes!I24)","v":"Agnes AUDEBERT-Nicolas RAUCH-Jerome ROUGE-Nathalie BAUDIER-Isabelle JOUBERT"},{"$f":"VLOOKUP(A27,Equipes!A:J,2,FALSE)","v":"M"},{"$f":"ROUND(VLOOKUP(A27,Equipes!$A$2:$J$41,10,0),0)","v":50},"10:00:00","10:31:24","10:56:32","11:28:06","11:53:02","01:53:02","00:31:14"]
[{"$f":"Equipes!A25","v":24},{"$f":"Equipes!C25","v":"MEULAN LES MUREAUX AMMH 1"},{"$f":"Equipes!D25","v":"AMMH1"},{"$f":"CONCATENATE(Equipes!E25,Equipes!$L$3,Equipes!F25,Equipes!$L$3,Equipes!G25,Equipes!$L$3,Equipes!H25,Equipes!$L$3,Equipes!I25)","v":"Xavier MARSAIS-Eric PRENEY-Yannick DAGMEY-David COINE-Arthur VAN SLOOTEN"},{"$f":"VLOOKUP(A28,Equipes!A:J,2,FALSE)","v":"H"},{"$f":"ROUND(VLOOKUP(A28,Equipes!$A$2:$J$41,10,0),0)","v":53},"10:02:59","10:29:42","10:50:58","11:18:58","11:39:03","01:36:04","00:14:16"]
[{"$f":"Equipes!A26","v":25},{"$f":"Equipes!C26","v":"VILLENNES - POISSY AC 2"},{"$f":"Equipes!D26","v":"ACVP2"},{"$f":"CONCATENATE(Equipes!E26,Equipes!$L$3,Equipes!F26,Equipes!$L$3,Equipes!G26,Equipes!$L$3,Equipes!H26,Equipes!$L$3,Equipes!I26)","v":"Franck CARIOU-Michael LE BANNER-Valerie DECAESTECKER-Karine GUILBON-Christophe ELINE"},{"$f":"VLOOKUP(A29,Equipes!A:J,2,FALSE)","v":"M"},{"$f":"ROUND(VLOOKUP(A29,Equipes!$A$2:$J$41,10,0),0)","v":54},"10:05:01","10:31:39","10:52:48","11:21:14","11:43:28","01:38:27","00:16:39"]
[{"$f":"Equipes!A27","v":26},{"$f":"Equipes!C27","v":"EVRY SCA 1"},{"$f":"Equipes!D27","v":"SCA 1"},{"$f":"CONCATENATE(Equipes!E27,Equipes!$L$3,Equipes!F27,Equipes!$L$3,Equipes!G27,Equipes!$L$3,Equipes!H27,Equipes!$L$3,Equipes!I27)","v":"Anne CARDUNER-Olivia PEZZOLI-Bruno CASIMIR-Lionel BOISSONNAT-Kristell MAUCHET"},{"$f":"VLOOKUP(A30,Equipes!A:J,2,FALSE)","v":"M"},{"$f":"ROUND(VLOOKUP(A30,Equipes!$A$2:$J$41,10,0),0)","v":56},"10:07:01","10:36:39","10:59:33","11:29:29","11:53:31","01:46:30","00:24:42"]
[{"$f":"Equipes!A28","v":27},{"$f":"Equipes!C28","v":"MEULAN LES MUREAUX AMMH 1"},{"$f":"Equipes!D28","v":"AMMH1"},{"$f":"CONCATENATE(Equipes!E28,Equipes!$L$3,Equipes!F28,Equipes!$L$3,Equipes!G28,Equipes!$L$3,Equipes!H28,Equipes!$L$3,Equipes!I28)","v":"Gwenaelle MARSAIS-Sophie SEFFAR-Catherine MARTINIER-Christelle GOANVIC-Marie LAMORE"},{"$f":"VLOOKUP(A31,Equipes!A:J,2,FALSE)","v":"F"},{"$f":"ROUND(VLOOKUP(A31,Equipes!$A$2:$J$41,10,0),0)","v":47},"10:09:01","10:42:15","11:09:37","11:42:48","12:08:48","01:59:47","00:37:59"]
[{"$f":"Equipes!A29","v":28},{"$f":"Equipes!C29","v":"VILLENNES - POISSY AC 1"},{"$f":"Equipes!D29","v":"ACVP1"},{"$f":"CONCATENATE(Equipes!E29,Equipes!$L$3,Equipes!F29,Equipes!$L$3,Equipes!G29,Equipes!$L$3,Equipes!H29,Equipes!$L$3,Equipes!I29)","v":"Frederic LE ROUX-Corinne HUARD-ROLLAND-Elodie DEREMIENCE-Marie-Claude LAUNAY-Olivier COSNEAU"},{"$f":"VLOOKUP(A32,Equipes!A:J,2,FALSE)","v":"M"},{"$f":"ROUND(VLOOKUP(A32,Equipes!$A$2:$J$41,10,0),0)","v":53},"10:11:10","10:37:24","10:57:26","11:23:13","11:42:17","01:31:07","00:09:19"]
[{"$f":"Equipes!A30","v":29},{"$f":"Equipes!C30","v":"FONTAINEBLEAU APF 1"},{"$f":"Equipes!D30","v":"APF1"},{"$f":"CONCATENATE(Equipes!E30,Equipes!$L$3,Equipes!F30,Equipes!$L$3,Equipes!G30,Equipes!$L$3,Equipes!H30,Equipes!$L$3,Equipes!I30)","v":"Kathleen SANCHEZ-Laurent FOUQUE-Christian MESSALES-Denis FLORY-David WEBER"},{"$f":"VLOOKUP(A33,Equipes!A:J,2,FALSE)","v":"H"},{"$f":"ROUND(VLOOKUP(A33,Equipes!$A$2:$J$41,10,0),0)","v":57},"10:13:00","10:43:14","11:07:12","11:36:29","12:01:05","01:48:05","00:26:17"]
[{"$f":"Equipes!A31","v":30},{"$f":"Equipes!C31","v":"JOINVILLE AMJ 1"},{"$f":"Equipes!D31","v":"AMJ1"},{"$f":"CONCATENATE(Equipes!E31,Equipes!$L$3,Equipes!F31,Equipes!$L$3,Equipes!G31,Equipes!$L$3,Equipes!H31,Equipes!$L$3,Equipes!I31)","v":"Vincent FABIEN-Arnaud PUPPO-Jonathan ROOKE-Xavier SUCHET-Nicolas JAMAULT"},{"$f":"VLOOKUP(A34,Equipes!A:J,2,FALSE)","v":"H"},{"$f":"ROUND(VLOOKUP(A34,Equipes!$A$2:$J$41,10,0),0)","v":51},"10:15:00","10:42:26","11:03:39","11:30:15","11:51:06","01:36:06","00:14:18"]
[{"$f":"Equipes!A32","v":31},{"$f":"Equipes!C32","v":"NOGENT SUR MARNE CN 3"},{"$f":"Equipes!D32","v":"CN3"},{"$f":"CONCATENATE(Equipes!E32,Equipes!$L$3,Equipes!F32,Equipes!$L$3,Equipes!G32,Equipes!$L$3,Equipes!H32,Equipes!$L$3,Equipes!I32)","v":"Alexandra COHEN SALMON-Isabelle MILON-BANNEROT-Jerome TROMBOFSKY-Olivier PASCAL-Elisabeth LAUNAY"},{"$f":"VLOOKUP(A35,Equipes!A:J,2,FALSE)","v":"M"},{"$f":"ROUND(VLOOKUP(A35,Equipes!$A$2:$J$41,10,0),0)","v":53},"10:17:03","10:49:06","11:13:20","11:47:13","12:13:50","01:56:47","00:34:59"]
[{"$f":"Equipes!A33","v":32},{"$f":"Equipes!C33","v":"BOULOGNE 92 1"},{"$f":"Equipes!D33","v":"ACBB1"},{"$f":"CONCATENATE(Equipes!E33,Equipes!$L$3,Equipes!F33,Equipes!$L$3,Equipes!G33,Equipes!$L$3,Equipes!H33,Equipes!$L$3,Equipes!I33)","v":"Isabelle MAIRE-Théo BEL BERBEL- LURBE-Thã‰Odore SEDAROS-Omar OUAZZANI-Alexandra MENEZES"},{"$f":"VLOOKUP(A36,Equipes!A:J,2,FALSE)","v":"H"},{"$f":"ROUND(VLOOKUP(A36,Equipes!$A$2:$J$41,10,0),0)","v":43},null,null,null,null,null,"99:99:99",{"$error":"#VALUE!"}]
[{"$f":"Equipes!A34","v":33},{"$f":"Equipes!C34","v":"XX"},{"$f":"Equipes!D34","v":"XX"},{"$f":"CONCATENATE(Equipes!E34,Equipes!$L$3,Equipes!F34,Equipes!$L$3,Equipes!G34,Equipes!$L$3,Equipes!H34,Equipes!$L$3,Equipes!I34)","v":"XX-XX-XX-XX-XX"},{"$f":"VLOOKUP(A37,Equipes!A:J,2,FALSE)","v":"X"},{"$f":"ROUND(VLOOKUP(A37,Equipes!$A$2:$J$41,10,0),0)","v":0},null,null,null,null,null,"99:99:99",{"$error":"#VALUE!"}]
[{"$f":"Equipes!A35","v":34},{"$f":"Equipes!C35","v":"XX"},{"$f":"Equipes!D35","v":"XX"},{"$f":"CONCATENATE(Equipes!E35,Equipes!$L$3,Equipes!F35,Equipes!$L$3,Equipes!G35,Equipes!$L$3,Equipes!H35,Equipes!$L$3,Equipes!I35)","v":"XX-XX-XX-XX-XX"},{"$f":"VLOOKUP(A38,Equipes!A:J,2,FALSE)","v":"X"},{"$f":"ROUND(VLOOKUP(A38,Equipes!$A$2:$J$41,10,0),0)","v":0},"10:19:09",null,"10:54:26",null,"11:24:06","01:04:57",-1.1701388888888886E-2]
[{"$f":"Equipes!A36","v":35},{"$f":"Equipes!C36","v":"XX"},{"$f":"Equipes!D36","v":"XX"},{"$f":"CONCATENATE(Equipes!E36,Equipes!$L$3,Equipes!F36,Equipes!$L$3,Equipes!G36,Equipes!$L$3,Equipes!H36,Equipes!$L$3,Equipes!I36)","v":"XX-XX-XX-XX-XX"},{"$f":"VLOOKUP(A39,Equipes!A:J,2,FALSE)","v":"X"},{"$f":"ROUND(VLOOKUP(A39,Equipes!$A$2:$J$41,10,0),0)","v":0},null,null,null,null,null,"99:99:99",{"$error":"#VALUE!"}]
[{"$f":"Equipes!A37","v":36},{"$f":"Equipes!C37","v":"XX"},{"$f":"Equipes!D37","v":"XX"},{"$f":"CONCATENATE(Equipes!E37,Equipes!$L$3,Equipes!F37,Equipes!$L$3,Equipes!G37,Equipes!$L$3,Equipes!H37,Equipes!$L$3,Equipes!I37)","v":"XX-XX-XX-XX-XX"},{"$f":"VLOOKUP(A40,Equipes!A:J,2,FALSE)","v":"X"},{"$f":"ROUND(VLOOKUP(A40,Equipes!$A$2:$J$41,10,0),0)","v":0},null,null,null,null,null,"99:99:99",{"$error":"#VALUE!"}]
[{"$f":"Equipes!A38","v":37},{"$f":"Equipes!C38","v":"XX"},{"$f":"Equipes!D38","v":"XX"},{"$f":"CONCATENATE(Equipes!E38,Equipes!$L$3,Equipes!F38,Equipes!$L$3,Equipes!G38,Equipes!$L$3,Equipes!H38,Equipes!$L$3,Equipes!I38)","v":"XX-XX-XX-XX-XX"},{"$f":"VLOOKUP(A41,Equipes!A:J,2,FALSE)","v":"X"},{"$f":"ROUND(VLOOKUP(A41,Equipes!$A$2:$J$41,10,0),0)","v":0},null,null,null,null,null,"99:99:99",{"$error":"#VALUE!"}]
[{"$f":"Equipes!A39","v":38},{"$f":"Equipes!C39","v":"XX"},{"$f":"Equipes!D39","v":"XX"},{"$f":"CONCATENATE(Equipes!E39,Equipes!$L$3,Equipes!F39,Equipes!$L$3,Equipes!G39,Equipes!$L$3,Equipes!H39,Equipes!$L$3,Equipes!I39)","v":"XX-XX-XX-XX-XX"},{"$f":"VLOOKUP(A42,Equipes!A:J,2,FALSE)","v":"X"},{"$f":"ROUND(VLOOKUP(A42,Equipes!$A$2:$J$41,10,0),0)","v":0},null,null,null,null,null,"99:99:99",{"$error":"#VALUE!"}]
[{"$f":"Equipes!A40","v":39},{"$f":"Equipes!C40","v":"XX"},{"$f":"Equipes!D40","v":"XX"},{"$f":"CONCATENATE(Equipes!E40,Equipes!$L$3,Equipes!F40,Equipes!$L$3,Equipes!G40,Equipes!$L$3,Equipes!H40,Equipes!$L$3,Equipes!I40)","v":"XX-XX-XX-XX-XX"},{"$f":"VLOOKUP(A43,Equipes!A:J,2,FALSE)","v":"X"},{"$f":"ROUND(VLOOKUP(A43,Equipes!$A$2:$J$41,10,0),0)","v":0},null,null,null,null,null,"99:99:99",{"$error":"#VALUE!"}]
[{"$f":"Equipes!A41","v":40},{"$f":"Equipes!C41","v":"XX"},{"$f":"Equipes!D41","v":"XX"},{"$f":"CONCATENATE(Equipes!E41,Equipes!$L$3,Equipes!F41,Equipes!$L$3,Equipes!G41,Equipes!$L$3,Equipes!H41,Equipes!$L$3,Equipes!I41)","v":"XX-XX-XX-XX-XX"},{"$f":"VLOOKUP(A44,Equipes!A:J,2,FALSE)","v":"X"},{"$f":"ROUND(VLOOKUP(A44,Equipes!$A$2:$J$41,10,0),0)","v":0},null,null,null,null,null,"99:99:99",{"$f":"+L44-$L$4","v":{"$error":"#VALUE!"}}]
[]
[null,null,null,null,"coupe vainqueur toute catégorie",null,"-Masculin"]
[null,null,null,null,"coupe feminine",null,"- Feminin"]
[null,null,null,null,"coupe mixte (mini 2 filles)",null,"- Mixte"]

{"sheet":"TEMPS-poissy","index":13,"n_rows":44,"n_cols":14,"rows_kept":44,"cut":false,"hidden":false,"merged":[[1,9,1,11],[2,3,3,3],[2,0,3,0],[2,1,3,1],[3,6,3,8],[3,9,3,11],[2,2,3,2],[0,0,1,2],[0,3,1,3],[0,6,0,8],[1,6,1,8],[0,9,0,11],[2,4,3,4],[2,5,3,5],[1,4,1,5]]}
["GRAND HUIT",null,null,{"$f":"'Note explicative fichier'!E3","v":"2024-06-02"},null,null,"PONT de POISSY",null,null,{"$f":"G1","v":"PONT de POISSY"}]
[null,null,null,null,null,null,"SLALOM 1",null,null,"SLALOM 2",null,null,null,"Pénalité"]
["Yolette N°","Club","Ville","Equipage ","Classe","Moy. Age","Poissy-1\nArrivée","Poissy-1\nFin","Pénalité\n3' ou 5'","Poissy-2\nArrivée","Poissy-2\nFin","Pénalité\n3' ou 5'",null,"00:00:00"]
[null,null,null,null,null,null,"Indiquer : Heures - Minutes - Secondes",null,null,"Indiquer : Heures - Minutes - Secondes",null,null,null,"00:02:00"]
[{"$f":"'TEMPS-ponton'!A5","v":1},{"$f":"'TEMPS-ponton'!B5","v":"ANDRESY CA CONFLUENT 1"},{"$f":"'TEMPS-ponton'!C5","v":"Cac1"},{"$f":"'TEMPS-ponton'!D5","v":"Stephanie LAPORTE-Marine NACERI-Marc LACCASSAGNE-Stephane ZETTWOOG-Fouzia VOIRIN"},{"$f":"VLOOKUP(A5,Equipes!A:J,2,FALSE)","v":"M"},{"$f":"ROUND(VLOOKUP(A5,Equipes!$A$2:$J$41,10,0),0)","v":49},null,null,null,null,null,null,null,"00:03:00"]
[{"$f":"'TEMPS-ponton'!A6","v":2},{"$f":"'TEMPS-ponton'!B6","v":"CAUDEBEC EN CAUX ACVS 1"},{"$f":"'TEMPS-ponton'!C6","v":"Caudebec"},{"$f":"'TEMPS-ponton'!D6","v":"Martine NARBAIS-JAUREGUY-Caroline KERVRANN-Stephane DELAMARE-Nicolas BARRAY-Francois NARBAIS-JAUREGUY"},{"$f":"VLOOKUP(A6,Equipes!A:J,2,FALSE)","v":"M"},{"$f":"ROUND(VLOOKUP(A6,Equipes!$A$2:$J$41,10,0),0)","v":55},null,null,null,null,null,null,null,"00:05:00"]
[{"$f":"'TEMPS-ponton'!A7","v":3},{"$f":"'TEMPS-ponton'!B7","v":"ANDRESY CA CONFLUENT 2"},{"$f":"'TEMPS-ponton'!C7","v":"CAC 2"},{"$f":"'TEMPS-ponton'!D7","v":"Anna ALCALOIDEPOIXBLANC-Geoffrey GHIZZONI-Nathalie BOURGEOIS-Franck CHRISTIANNOT-NicOLAS delaunoy"},{"$f":"VLOOKUP(A7,Equipes!A:J,2,FALSE)","v":"M"},{"$f":"ROUND(VLOOKUP(A7,Equipes!$A$2:$J$41,10,0),0)","v":55}]
[{"$f":"'TEMPS-ponton'!A8","v":4},{"$f":"'TEMPS-ponton'!B8","v":"ANDRESY CA CONFLUENT 1"},{"$f":"'TEMPS-ponton'!C8","v":"CAC3"},{"$f":"'TEMPS-ponton'!D8","v":"Emmanuel SALIN-Ousseni PARKOUDA-Jean-Baptiste PROVENZANO-Jerome CLAVE-Julian GALLELA"},{"$f":"VLOOKUP(A8,Equipes!A:J,2,FALSE)","v":"H"},{"$f":"ROUND(VLOOKUP(A8,Equipes!$A$2:$J$41,10,0),0)","v":46}]
[{"$f":"'TEMPS-ponton'!A9","v":5},{"$f":"'TEMPS-ponton'!B9","v":"PORT-MARLY RC 1"},{"$f":"'TEMPS-ponton'!C9","v":"RCPM"},{"$f":"'TEMPS-ponton'!D9","v":"Claudie BODIN-Fanny LAMOUR-Etienne DUPUIS-Jeancharles FAUCHEUX-Gildas KETTANJIAN"},{"$f":"VLOOKUP(A9,Equipes!A:J,2,FALSE)","v":"M"},{"$f":"ROUND(VLOOKUP(A9,Equipes!$A$2:$J$41,10,0),0)","v":50}]
[{"$f":"'TEMPS-ponton'!A10","v":6},{"$f":"'TEMPS-ponton'!B10","v":"BOULOGNE 92 2"},{"$f":"'TEMPS-ponton'!C10","v":"ACBB"},{"$f":"'TEMPS-ponton'!D10","v":"CéLia ROUSSELLE-Marie Pierre MARSALLON GAMBY-Françis ROBIN-Nicolas LECOEUR-Theodora XENOGIANI"},{"$f":"VLOOKUP(A10,Equipes!A:J,2,FALSE)","v":"M"},{"$f":"ROUND(VLOOKUP(A10,Equipes!$A$2:$J$41,10,0),0)","v":46}]
[{"$f":"'TEMPS-ponton'!A11","v":7},{"$f":"'TEMPS-ponton'!B11","v":"VILLENNES - POISSY AC 3"},{"$f":"'TEMPS-ponton'!C11","v":"ACVP"},{"$f":"'TEMPS-ponton'!D11","v":"Virginie ALEXANDRE-Jihad LEMARQRI-Cyrille BRUZON-BASCOU-Sebastien CARPENTIER-Marie Estelle D'ARBAUMONT"},{"$f":"VLOOKUP(A11,Equipes!A:J,2,FALSE)","v":"M"},{"$f":"ROUND(VLOOKUP(A11,Equipes!$A$2:$J$41,10,0),0)","v":49}]
[{"$f":"'TEMPS-ponton'!A12","v":8},{"$f":"'TEMPS-ponton'!B12","v":"JOINVILLE AMJ 1"},{"$f":"'TEMPS-ponton'!C12","v":"Joinville"},{"$f":"'TEMPS-ponton'!D12","v":"Laurent BAUDOIN-Raphaelle BOUVIER FLORY-Sophie BUSTOS-Kastriot JAKA-Thomas AUGER"},{"$f":"VLOOKUP(A12,Equipes!A:J,2,FALSE)","v":"M"},{"$f":"ROUND(VLOOKUP(A12,Equipes!$A$2:$J$41,10,0),0)","v":46}]
[{"$f":"'TEMPS-ponton'!A13","v":9},{"$f":"'TEMPS-ponton'!B13","v":"NOGENT SUR MARNE CN 1"},{"$f":"'TEMPS-ponton'!C13","v":"CN 1"},{"$f":"'TEMPS-ponton'!D13","v":"Chrystelle SUPIOT-Caroline PIEDNOIRE-Olivier MUCIGNAT-Andre SIMONNET-Fabienne LORTIE"},{"$f":"VLOOKUP(A13,Equipes!A:J,2,FALSE)","v":"M"},{"$f":"ROUND(VLOOKUP(A13,Equipes!$A$2:$J$41,10,0),0)","v":53}]
[{"$f":"'TEMPS-ponton'!A14","v":10},{"$f":"'TEMPS-ponton'!B14","v":"NOGENT SUR MARNE CN 2"},{"$f":"'TEMPS-ponton'!C14","v":"CN2"},{"$f":"'TEMPS-ponton'!D14","v":"Christophe RUCKEBUSCH-Nicolas BURCKHART-Alice GHEERBRANT-Aurelie DONVAL-Gerard LECA"},{"$f":"VLOOKUP(A14,Equipes!A:J,2,FALSE)","v":"M"},{"$f":"ROUND(VLOOKUP(A14,Equipes!$A$2:$J$41,10,0),0)","v":53}]
[{"$f":"'TEMPS-ponton'!A15","v":11},{"$f":"'TEMPS-ponton'!B15","v":"BOULOGNE 92 1"},{"$f":"'TEMPS-ponton'!C15","v":"ACBB"},{"$f":"'TEMPS-ponton'!D15","v":"Viviane BALLOY-Timothé BAZIRIES-Alexandre LE FUR-Sigrid PABST-Michel VEDRINE"},{"$f":"VLOOKUP(A15,Equipes!A:J,2,FALSE)","v":"H"},{"$f":"ROUND(VLOOKUP(A15,Equipes!$A$2:$J$41,10,0),0)","v":51}]
[{"$f":"'TEMPS-ponton'!A16","v":12},{"$f":"'TEMPS-ponton'!B16","v":"EVRY SCA 2"},{"$f":"'TEMPS-ponton'!C16","v":"SCA2"},{"$f":"'TEMPS-ponton'!D16","v":"Laurent YEBOAH-Isabelle MOISSET FLEURISSON-Frederic DUCAUQUY-Sandrine GARCIA-Christelle MARTIN"},{"$f":"VLOOKUP(A16,Equipes!A:J,2,FALSE)","v":"M"},{"$f":"ROUND(VLOOKUP(A16,Equipes!$A$2:$J$41,10,0),0)","v":48}]
[{"$f":"'TEMPS-ponton'!A17","v":13},{"$f":"'TEMPS-ponton'!B17","v":"PORT-MARLY RC 2"},{"$f":"'TEMPS-ponton'!C17","v":"RCPM2"},{"$f":"'TEMPS-ponton'!D17","v":"Elsa CROZATIER-Cyrielle BERTHIER-Hervé Valette-Eric MOINARD-Anais FEUGA"},{"$f":"VLOOKUP(A17,Equipes!A:J,2,FALSE)","v":"M"},{"$f":"ROUND(VLOOKUP(A17,Equipes!$A$2:$J$41,10,0),0)","v":47}]
[{"$f":"'TEMPS-ponton'!A18","v":14},{"$f":"'TEMPS-ponton'!B18","v":"MAISONS MESNIL CERAMM 1"},{"$f":"'TEMPS-ponton'!C18","v":"CERAMM1"},{"$f":"'TEMPS-ponton'!D18","v":"Nicolas SCHMITT-Gloria VENDRELL-Christine MARIE LAVAUD-Amaury DE LA LAURENCIE-Amina ELABBADI"},{"$f":"VLOOKUP(A18,Equipes!A:J,2,FALSE)","v":"M"},{"$f":"ROUND(VLOOKUP(A18,Equipes!$A$2:$J$41,10,0),0)","v":50}]
[{"$f":"'TEMPS-ponton'!A19","v":15},{"$f":"'TEMPS-ponton'!B19","v":"SOISY SUR SEINE CN 1"},{"$f":"'TEMPS-ponton'!C19","v":"CN1"},{"$f":"'TEMPS-ponton'!D19","v":"Bertrand PIOGER-Bruno PERIQUOI-Servane BERTRAND-Alain BERNARD-Robert TRAUET"},{"$f":"VLOOKUP(A19,Equipes!A:J,2,FALSE)","v":"H"},{"$f":"ROUND(VLOOKUP(A19,Equipes!$A$2:$J$41,10,0),0)","v":54}]
[{"$f":"'TEMPS-ponton'!A20","v":16},{"$f":"'TEMPS-ponton'!B20","v":"PORT-MARLY RC 1"},{"$f":"'TEMPS-ponton'!C20","v":"RCPM1"},{"$f":"'TEMPS-ponton'!D20","v":"Jean-Claude LAFOREST-David CHARTIER-Christophe MARCAIS-Vincent BONTOUX-Alain ROUSSEAU"},{"$f":"VLOOKUP(A20,Equipes!A:J,2,FALSE)","v":"H"},{"$f":"ROUND(VLOOKUP(A20,Equipes!$A$2:$J$41,10,0),0)","v":55}]
[{"$f":"'TEMPS-ponton'!A21","v":17},{"$f":"'TEMPS-ponton'!B21","v":"ANDRESY CA CONFLUENT 1"},{"$f":"'TEMPS-ponton'!C21","v":"CAC1"},{"$f":"'TEMPS-ponton'!D21","v":"Daphne PARIZOT-Agnes BURGHGRAEVE SELLEN-Sylvie FRANSSEN-Severine LEGAILLARD-Martine LE ROUX"},{"$f":"VLOOKUP(A21,Equipes!A:J,2,FALSE)","v":"F"},{"$f":"ROUND(VLOOKUP(A21,Equipes!$A$2:$J$41,10,0),0)","v":55}]
[{"$f":"'TEMPS-ponton'!A22","v":18},{"$f":"'TEMPS-ponton'!B22","v":"MAISONS MESNIL CERAMM 2"},{"$f":"'TEMPS-ponton'!C22","v":"CERAMM2"},{"$f":"'TEMPS-ponton'!D22","v":"Claude LEMENAGER-Didier GIRARDEAU-Laurent LIBOTTE-Alain GIRARD-Cecile JEAMMES"},{"$f":"VLOOKUP(A22,Equipes!A:J,2,FALSE)","v":"H"},{"$f":"ROUND(VLOOKUP(A22,Equipes!$A$2:$J$41,10,0),0)","v":58}]
[{"$f":"'TEMPS-ponton'!A23","v":19},{"$f":"'TEMPS-ponton'!B23","v":"VILLENNES - POISSY AC 1"},{"$f":"'TEMPS-ponton'!C23","v":"ACVP1"},{"$f":"'TEMPS-ponton'!D23","v":"Olivier POLGE-Odile POLGE-Laurent BONHOMMET-Antoine VOLPI-Philippe STROHM"},{"$f":"VLOOKUP(A23,Equipes!A:J,2,FALSE)","v":"H"},{"$f":"ROUND(VLOOKUP(A23,Equipes!$A$2:$J$41,10,0),0)","v":55}]
[{"$f":"'TEMPS-ponton'!A24","v":20},{"$f":"'TEMPS-ponton'!B24","v":"ROUEN CNAR 1"},{"$f":"'TEMPS-ponton'!C24","v":"CNAR1"},{"$f":"'TEMPS-ponton'!D24","v":"Nathalie MOUSSET-Francois LAIR-Betty GESLAIN-Thierry DUCHESNE-Stephane MOUSSET"},{"$f":"VLOOKUP(A24,Equipes!A:J,2,FALSE)","v":"M"},{"$f":"ROUND(VLOOKUP(A24,Equipes!$A$2:$J$41,10,0),0)","v":55}]
[{"$f":"'TEMPS-ponton'!A25","v":21},{"$f":"'TEMPS-ponton'!B25","v":"PORT-MARLY RC 2"},{"$f":"'TEMPS-ponton'!C25","v":"RCPM2"},{"$f":"'TEMPS-ponton'!D25","v":"Guillaume CHARRON-Philippe VERHE-Stephan REYNIER-Dominique LEROUX-Luciano AUTUNNALE"},{"$f":"VLOOKUP(A25,Equipes!A:J,2,FALSE)","v":"H"},{"$f":"ROUND(VLOOKUP(A25,Equipes!$A$2:$J$41,10,0),0)","v":51}]
[{"$f":"'TEMPS-ponton'!A26","v":22},{"$f":"'TEMPS-ponton'!B26","v":"COUDRAY MONTCEAUX A 1"},{"$f":"'TEMPS-ponton'!C26","v":"coudray1"},{"$f":"'TEMPS-ponton'!D26","v":"Joseph RAYNAUD-Frederic MORAT-Benjamin HOUILLON-Pascal BEAUSSART-Anne HOUAL"},{"$f":"VLOOKUP(A26,Equipes!A:J,2,FALSE)","v":"H"},{"$f":"ROUND(VLOOKUP(A26,Equipes!$A$2:$J$41,10,0),0)","v":52}]
[{"$f":"'TEMPS-ponton'!A27","v":23},{"$f":"'TEMPS-ponton'!B27","v":"SN OISE 1"},{"$f":"'TEMPS-ponton'!C27","v":"SN Oise 1\n"},{"$f":"'TEMPS-ponton'!D27","v":"Agnes AUDEBERT-Nicolas RAUCH-Jerome ROUGE-Nathalie BAUDIER-Isabelle JOUBERT"},{"$f":"VLOOKUP(A27,Equipes!A:J,2,FALSE)","v":"M"},{"$f":"ROUND(VLOOKUP(A27,Equipes!$A$2:$J$41,10,0),0)","v":50}]
[{"$f":"'TEMPS-ponton'!A28","v":24},{"$f":"'TEMPS-ponton'!B28","v":"MEULAN LES MUREAUX AMMH 1"},{"$f":"'TEMPS-ponton'!C28","v":"AMMH1"},{"$f":"'TEMPS-ponton'!D28","v":"Xavier MARSAIS-Eric PRENEY-Yannick DAGMEY-David COINE-Arthur VAN SLOOTEN"},{"$f":"VLOOKUP(A28,Equipes!A:J,2,FALSE)","v":"H"},{"$f":"ROUND(VLOOKUP(A28,Equipes!$A$2:$J$41,10,0),0)","v":53}]
[{"$f":"'TEMPS-ponton'!A29","v":25},{"$f":"'TEMPS-ponton'!B29","v":"VILLENNES - POISSY AC 2"},{"$f":"'TEMPS-ponton'!C29","v":"ACVP2"},{"$f":"'TEMPS-ponton'!D29","v":"Franck CARIOU-Michael LE BANNER-Valerie DECAESTECKER-Karine GUILBON-Christophe ELINE"},{"$f":"VLOOKUP(A29,Equipes!A:J,2,FALSE)","v":"M"},{"$f":"ROUND(VLOOKUP(A29,Equipes!$A$2:$J$41,10,0),0)","v":54}]
[{"$f":"'TEMPS-ponton'!A30","v":26},{"$f":"'TEMPS-ponton'!B30","v":"EVRY SCA 1"},{"$f":"'TEMPS-ponton'!C30","v":"SCA 1"},{"$f":"'TEMPS-ponton'!D30","v":"Anne CARDUNER-Olivia PEZZOLI-Bruno CASIMIR-Lionel BOISSONNAT-Kristell MAUCHET"},{"$f":"VLOOKUP(A30,Equipes!A:J,2,FALSE)","v":"M"},{"$f":"ROUND(VLOOKUP(A30,Equipes!$A$2:$J$41,10,0),0)","v":56}]
[{"$f":"'TEMPS-ponton'!A31","v":27},{"$f":"'TEMPS-ponton'!B31","v":"MEULAN LES MUREAUX AMMH 1"},{"$f":"'TEMPS-ponton'!C31","v":"AMMH1"},{"$f":"'TEMPS-ponton'!D31","v":"Gwenaelle MARSAIS-Sophie SEFFAR-Catherine MARTINIER-Christelle GOANVIC-Marie LAMORE"},{"$f":"VLOOKUP(A31,Equipes!A:J,2,FALSE)","v":"F"},{"$f":"ROUND(VLOOKUP(A31,Equipes!$A$2:$J$41,10,0),0)","v":47}]
[{"$f":"'TEMPS-ponton'!A32","v":28},{"$f":"'TEMPS-ponton'!B32","v":"VILLENNES - POISSY AC 1"},{"$f":"'TEMPS-ponton'!C32","v":"ACVP1"},{"$f":"'TEMPS-ponton'!D32","v":"Frederic LE ROUX-Corinne HUARD-ROLLAND-Elodie DEREMIENCE-Marie-Claude LAUNAY-Olivier COSNEAU"},{"$f":"VLOOKUP(A32,Equipes!A:J,2,FALSE)","v":"M"},{"$f":"ROUND(VLOOKUP(A32,Equipes!$A$2:$J$41,10,0),0)","v":53}]
[{"$f":"'TEMPS-ponton'!A33","v":29},{"$f":"'TEMPS-ponton'!B33","v":"FONTAINEBLEAU APF 1"},{"$f":"'TEMPS-ponton'!C33","v":"APF1"},{"$f":"'TEMPS-ponton'!D33","v":"Kathleen SANCHEZ-Laurent FOUQUE-Christian MESSALES-Denis FLORY-David WEBER"},{"$f":"VLOOKUP(A33,Equipes!A:J,2,FALSE)","v":"H"},{"$f":"ROUND(VLOOKUP(A33,Equipes!$A$2:$J$41,10,0),0)","v":57}]
[{"$f":"'TEMPS-ponton'!A34","v":30},{"$f":"'TEMPS-ponton'!B34","v":"JOINVILLE AMJ 1"},{"$f":"'TEMPS-ponton'!C34","v":"AMJ1"},{"$f":"'TEMPS-ponton'!D34","v":"Vincent FABIEN-Arnaud PUPPO-Jonathan ROOKE-Xavier SUCHET-Nicolas JAMAULT"},{"$f":"VLOOKUP(A34,Equipes!A:J,2,FALSE)","v":"H"},{"$f":"ROUND(VLOOKUP(A34,Equipes!$A$2:$J$41,10,0),0)","v":51}]
[{"$f":"'TEMPS-ponton'!A35","v":31},{"$f":"'TEMPS-ponton'!B35","v":"NOGENT SUR MARNE CN 3"},{"$f":"'TEMPS-ponton'!C35","v":"CN3"},{"$f":"'TEMPS-ponton'!D35","v":"Alexandra COHEN SALMON-Isabelle MILON-BANNEROT-Jerome TROMBOFSKY-Olivier PASCAL-Elisabeth LAUNAY"},{"$f":"VLOOKUP(A35,Equipes!A:J,2,FALSE)","v":"M"},{"$f":"ROUND(VLOOKUP(A35,Equipes!$A$2:$J$41,10,0),0)","v":53}]
[{"$f":"'TEMPS-ponton'!A36","v":32},{"$f":"'TEMPS-ponton'!B36","v":"BOULOGNE 92 1"},{"$f":"'TEMPS-ponton'!C36","v":"ACBB1"},{"$f":"'TEMPS-ponton'!D36","v":"Isabelle MAIRE-Théo BEL BERBEL- LURBE-Thã‰Odore SEDAROS-Omar OUAZZANI-Alexandra MENEZES"},{"$f":"VLOOKUP(A36,Equipes!A:J,2,FALSE)","v":"H"},{"$f":"ROUND(VLOOKUP(A36,Equipes!$A$2:$J$41,10,0),0)","v":43}]
[{"$f":"'TEMPS-ponton'!A37","v":33},{"$f":"'TEMPS-ponton'!B37","v":"XX"},{"$f":"'TEMPS-ponton'!C37","v":"XX"},{"$f":"'TEMPS-ponton'!D37","v":"XX-XX-XX-XX-XX"},{"$f":"VLOOKUP(A37,Equipes!A:J,2,FALSE)","v":"X"},{"$f":"ROUND(VLOOKUP(A37,Equipes!$A$2:$J$41,10,0),0)","v":0}]
[{"$f":"'TEMPS-ponton'!A38","v":34},{"$f":"'TEMPS-ponton'!B38","v":"XX"},{"$f":"'TEMPS-ponton'!C38","v":"XX"},{"$f":"'TEMPS-ponton'!D38","v":"XX-XX-XX-XX-XX"},{"$f":"VLOOKUP(A38,Equipes!A:J,2,FALSE)","v":"X"},{"$f":"ROUND(VLOOKUP(A38,Equipes!$A$2:$J$41,10,0),0)","v":0}]
[{"$f":"'TEMPS-ponton'!A39","v":35},{"$f":"'TEMPS-ponton'!B39","v":"XX"},{"$f":"'TEMPS-ponton'!C39","v":"XX"},{"$f":"'TEMPS-ponton'!D39","v":"XX-XX-XX-XX-XX"},{"$f":"VLOOKUP(A39,Equipes!A:J,2,FALSE)","v":"X"},{"$f":"ROUND(VLOOKUP(A39,Equipes!$A$2:$J$41,10,0),0)","v":0}]
[{"$f":"'TEMPS-ponton'!A40","v":36},{"$f":"'TEMPS-ponton'!B40","v":"XX"},{"$f":"'TEMPS-ponton'!C40","v":"XX"},{"$f":"'TEMPS-ponton'!D40","v":"XX-XX-XX-XX-XX"},{"$f":"VLOOKUP(A40,Equipes!A:J,2,FALSE)","v":"X"},{"$f":"ROUND(VLOOKUP(A40,Equipes!$A$2:$J$41,10,0),0)","v":0}]
[{"$f":"'TEMPS-ponton'!A41","v":37},{"$f":"'TEMPS-ponton'!B41","v":"XX"},{"$f":"'TEMPS-ponton'!C41","v":"XX"},{"$f":"'TEMPS-ponton'!D41","v":"XX-XX-XX-XX-XX"},{"$f":"VLOOKUP(A41,Equipes!A:J,2,FALSE)","v":"X"},{"$f":"ROUND(VLOOKUP(A41,Equipes!$A$2:$J$41,10,0),0)","v":0}]
[{"$f":"'TEMPS-ponton'!A42","v":38},{"$f":"'TEMPS-ponton'!B42","v":"XX"},{"$f":"'TEMPS-ponton'!C42","v":"XX"},{"$f":"'TEMPS-ponton'!D42","v":"XX-XX-XX-XX-XX"},{"$f":"VLOOKUP(A42,Equipes!A:J,2,FALSE)","v":"X"},{"$f":"ROUND(VLOOKUP(A42,Equipes!$A$2:$J$41,10,0),0)","v":0}]
[{"$f":"'TEMPS-ponton'!A43","v":39},{"$f":"'TEMPS-ponton'!B43","v":"XX"},{"$f":"'TEMPS-ponton'!C43","v":"XX"},{"$f":"'TEMPS-ponton'!D43","v":"XX-XX-XX-XX-XX"},{"$f":"VLOOKUP(A43,Equipes!A:J,2,FALSE)","v":"X"},{"$f":"ROUND(VLOOKUP(A43,Equipes!$A$2:$J$41,10,0),0)","v":0}]
[{"$f":"'TEMPS-ponton'!A44","v":40},{"$f":"'TEMPS-ponton'!B44","v":"XX"},{"$f":"'TEMPS-ponton'!C44","v":"XX"},{"$f":"'TEMPS-ponton'!D44","v":"XX-XX-XX-XX-XX"},{"$f":"VLOOKUP(A44,Equipes!A:J,2,FALSE)","v":"X"},{"$f":"ROUND(VLOOKUP(A44,Equipes!$A$2:$J$41,10,0),0)","v":0}]

{"sheet":"penalités","index":14,"n_rows":44,"n_cols":20,"rows_kept":44,"cut":false,"hidden":false,"merged":[[2,13,2,19],[0,0,1,2],[0,3,1,3],[0,6,1,8],[0,9,1,11],[0,13,0,19],[1,13,1,19],[0,4,1,5]]}
["GRAND 8     ",null,null,{"$f":"'Note explicative fichier'!E3","v":"2024-06-02"},null,null,"SLALOM 1",null,null,"SLALOM 2",null,null,"00:03:00"," = Refus de se laisser dépasser en zone non étroite\n = Dépassement ou arrêt en zône dangereuse  et étroite"]
[null,null,null,null,null,null,null,null,null,null,null,null,"00:02:00"," = Slalom incorrect, non respect du parcours imposé\n = Refus de priorité au bateau avalant, au bief Villennes/migneaux\n= changement de barreur hors zone"]
["Yolette N°","Club","Ville","Equipage ","Cat.","Age Moy.","Temps\nSlalom-1","Pénalité","Temps\nFinal\nSlalom 1","Temps\nSlalom-2","Pénalité","Temps\nFinal\nSlalom 2","00:05:00"," = Changement de barreur non réalisé à mi-course, face au ponton\n = Slalom « raccourci »sans remontée du courant vers Paris\n = Couper les courbes sur la  Seine"]
[{"$f":"'TEMPS-ponton'!A4","v":"Record"},{"$f":"'TEMPS-ponton'!B4","v":"POLYTECHNIQUE ( Référence 2012 )"},{"$f":"'TEMPS-ponton'!C4","v":"Palaiseau"},{"$f":"'TEMPS-ponton'!D4","v":"FERRERO Michel - Alexandre Rosinski - BOYAUD Mathieu - GODDE Olivier - THECKES Benoit"},null,null,null,null,null,null,null,null,"Total\npénalités","ponton","Sécu1","Sécu2","Sécu3","Sécu4","Sécu5","Sécu6"]
[{"$f":"'TEMPS-ponton'!A5","v":1},{"$f":"'TEMPS-ponton'!B5","v":"ANDRESY CA CONFLUENT 1"},{"$f":"'TEMPS-ponton'!C5","v":"Cac1"},{"$f":"'TEMPS-ponton'!D5","v":"Stephanie LAPORTE-Marine NACERI-Marc LACCASSAGNE-Stephane ZETTWOOG-Fouzia VOIRIN"},{"$f":"VLOOKUP(A5,Equipes!A:J,2,FALSE)","v":"M"},{"$f":"ROUND(VLOOKUP(A5,Equipes!$A$2:$J$41,10,0),0)","v":49},{"$f":"IF('TEMPS-poissy'!H5>0,'TEMPS-poissy'!H5-'TEMPS-poissy'!G5,\"\")","v":""},{"$f":"'TEMPS-poissy'!I5","v":"00:00:00"},{"$f":"IF('TEMPS-poissy'!H5>0,G5+H5,\"99:99:99\")","v":"99:99:99"},{"$f":"IF('TEMPS-poissy'!K5>0,'TEMPS-poissy'!K5-'TEMPS-poissy'!J5,\"\")","v":""},{"$f":"'TEMPS-poissy'!L5","v":"00:00:00"},{"$f":"IF('TEMPS-poissy'!K5>0,J5+K5,\"99:99:99\")","v":"99:99:99"},{"$f":"SUM(N5:T5)","v":"00:05:00"},"00:00:00","00:00:00","00:00:00","00:05:00","00:00:00","00:00:00","00:00:00"]
[{"$f":"'TEMPS-ponton'!A6","v":2},{"$f":"'TEMPS-ponton'!B6","v":"CAUDEBEC EN CAUX ACVS 1"},{"$f":"'TEMPS-ponton'!C6","v":"Caudebec"},{"$f":"'TEMPS-ponton'!D6","v":"Martine NARBAIS-JAUREGUY-Caroline KERVRANN-Stephane DELAMARE-Nicolas BARRAY-Francois NARBAIS-JAUREGUY"},{"$f":"VLOOKUP(A6,Equipes!A:J,2,FALSE)","v":"M"},{"$f":"ROUND(VLOOKUP(A6,Equipes!$A$2:$J$41,10,0),0)","v":55},{"$f":"IF('TEMPS-poissy'!H6>0,'TEMPS-poissy'!H6-'TEMPS-poissy'!G6,\"\")","v":""},{"$f":"'TEMPS-poissy'!I6","v":"00:00:00"},{"$f":"IF('TEMPS-poissy'!H6>0,G6+H6,\"99:99:99\")","v":"99:99:99"},{"$f":"IF('TEMPS-poissy'!K6>0,'TEMPS-poissy'!K6-'TEMPS-poissy'!J6,\"\")","v":""},{"$f":"'TEMPS-poissy'!L6","v":"00:00:00"},{"$f":"IF('TEMPS-poissy'!K6>0,J6+K6,\"99:99:99\")","v":"99:99:99"},"00:00:00","00:00:00","00:00:00","00:00:00","00:00:00","00:00:00","00:00:00","00:00:00"]
[{"$f":"'TEMPS-ponton'!A7","v":3},{"$f":"'TEMPS-ponton'!B7","v":"ANDRESY CA CONFLUENT 2"},{"$f":"'TEMPS-ponton'!C7","v":"CAC 2"},{"$f":"'TEMPS-ponton'!D7","v":"Anna ALCALOIDEPOIXBLANC-Geoffrey GHIZZONI-Nathalie BOURGEOIS-Franck CHRISTIANNOT-NicOLAS delaunoy"},{"$f":"VLOOKUP(A7,Equipes!A:J,2,FALSE)","v":"M"},{"$f":"ROUND(VLOOKUP(A7,Equipes!$A$2:$J$41,10,0),0)","v":55},{"$f":"IF('TEMPS-poissy'!H7>0,'TEMPS-poissy'!H7-'TEMPS-poissy'!G7,\"\")","v":""},{"$f":"'TEMPS-poissy'!I7","v":"00:00:00"},{"$f":"IF('TEMPS-poissy'!H7>0,G7+H7,\"99:99:99\")","v":"99:99:99"},{"$f":"IF('TEMPS-poissy'!K7>0,'TEMPS-poissy'!K7-'TEMPS-poissy'!J7,\"\")","v":""},{"$f":"'TEMPS-poissy'!L7","v":"00:00:00"},{"$f":"IF('TEMPS-poissy'!K7>0,J7+K7,\"99:99:99\")","v":"99:99:99"},{"$f":"SUM(N7:T7)","v":"00:00:00"},"00:00:00","00:00:00","00:00:00","00:00:00","00:00:00","00:00:00","00:00:00"]
[{"$f":"'TEMPS-ponton'!A8","v":4},{"$f":"'TEMPS-ponton'!B8","v":"ANDRESY CA CONFLUENT 1"},{"$f":"'TEMPS-ponton'!C8","v":"CAC3"},{"$f":"'TEMPS-ponton'!D8","v":"Emmanuel SALIN-Ousseni PARKOUDA-Jean-Baptiste PROVENZANO-Jerome CLAVE-Julian GALLELA"},{"$f":"VLOOKUP(A8,Equipes!A:J,2,FALSE)","v":"H"},{"$f":"ROUND(VLOOKUP(A8,Equipes!$A$2:$J$41,10,0),0)","v":46},{"$f":"IF('TEMPS-poissy'!H8>0,'TEMPS-poissy'!H8-'TEMPS-poissy'!G8,\"\")","v":""},{"$f":"'TEMPS-poissy'!I8","v":"00:00:00"},{"$f":"IF('TEMPS-poissy'!H8>0,G8+H8,\"99:99:99\")","v":"99:99:99"},{"$f":"IF('TEMPS-poissy'!K8>0,'TEMPS-poissy'!K8-'TEMPS-poissy'!J8,\"\")","v":""},{"$f":"'TEMPS-poissy'!L8","v":"00:00:00"},{"$f":"IF('TEMPS-poissy'!K8>0,J8+K8,\"99:99:99\")","v":"99:99:99"},"00:00:00","00:00:00","00:00:00","00:00:00","00:00:00","00:00:00","00:00:00","00:00:00"]
[{"$f":"'TEMPS-ponton'!A9","v":5},{"$f":"'TEMPS-ponton'!B9","v":"PORT-MARLY RC 1"},{"$f":"'TEMPS-ponton'!C9","v":"RCPM"},{"$f":"'TEMPS-ponton'!D9","v":"Claudie BODIN-Fanny LAMOUR-Etienne DUPUIS-Jeancharles FAUCHEUX-Gildas KETTANJIAN"},{"$f":"VLOOKUP(A9,Equipes!A:J,2,FALSE)","v":"M"},{"$f":"ROUND(VLOOKUP(A9,Equipes!$A$2:$J$41,10,0),0)","v":50},{"$f":"IF('TEMPS-poissy'!H9>0,'TEMPS-poissy'!H9-'TEMPS-poissy'!G9,\"\")","v":""},{"$f":"'TEMPS-poissy'!I9","v":"00:00:00"},{"$f":"IF('TEMPS-poissy'!H9>0,G9+H9,\"99:99:99\")","v":"99:99:99"},{"$f":"IF('TEMPS-poissy'!K9>0,'TEMPS-poissy'!K9-'TEMPS-poissy'!J9,\"\")","v":""},{"$f":"'TEMPS-poissy'!L9","v":"00:00:00"},{"$f":"IF('TEMPS-poissy'!K9>0,J9+K9,\"99:99:99\")","v":"99:99:99"},"00:00:00","00:00:00","00:00:00","00:00:00","00:00:00","00:00:00","00:00:00","00:00:00"]
[{"$f":"'TEMPS-ponton'!A10","v":6},{"$f":"'TEMPS-ponton'!B10","v":"BOULOGNE 92 2"},{"$f":"'TEMPS-ponton'!C10","v":"ACBB"},{"$f":"'TEMPS-ponton'!D10","v":"CéLia ROUSSELLE-Marie Pierre MARSALLON GAMBY-Françis ROBIN-Nicolas LECOEUR-Theodora XENOGIANI"},{"$f":"VLOOKUP(A10,Equipes!A:J,2,FALSE)","v":"M"},{"$f":"ROUND(VLOOKUP(A10,Equipes!$A$2:$J$41,10,0),0)","v":46},{"$f":"IF('TEMPS-poissy'!H10>0,'TEMPS-poissy'!H10-'TEMPS-poissy'!G10,\"\")","v":""},{"$f":"'TEMPS-poissy'!I10","v":"00:00:00"},{"$f":"IF('TEMPS-poissy'!H10>0,G10+H10,\"99:99:99\")","v":"99:99:99"},{"$f":"IF('TEMPS-poissy'!K10>0,'TEMPS-poissy'!K10-'TEMPS-poissy'!J10,\"\")","v":""},{"$f":"'TEMPS-poissy'!L10","v":"00:00:00"},{"$f":"IF('TEMPS-poissy'!K10>0,J10+K10,\"99:99:99\")","v":"99:99:99"},"00:00:00","00:00:00","00:00:00","00:00:00","00:00:00","00:00:00","00:00:00","00:00:00"]
[{"$f":"'TEMPS-ponton'!A11","v":7},{"$f":"'TEMPS-ponton'!B11","v":"VILLENNES - POISSY AC 3"},{"$f":"'TEMPS-ponton'!C11","v":"ACVP"},{"$f":"'TEMPS-ponton'!D11","v":"Virginie ALEXANDRE-Jihad LEMARQRI-Cyrille BRUZON-BASCOU-Sebastien CARPENTIER-Marie Estelle D'ARBAUMONT"},{"$f":"VLOOKUP(A11,Equipes!A:J,2,FALSE)","v":"M"},{"$f":"ROUND(VLOOKUP(A11,Equipes!$A$2:$J$41,10,0),0)","v":49},{"$f":"IF('TEMPS-poissy'!H11>0,'TEMPS-poissy'!H11-'TEMPS-poissy'!G11,\"\")","v":""},{"$f":"'TEMPS-poissy'!I11","v":"00:00:00"},{"$f":"IF('TEMPS-poissy'!H11>0,G11+H11,\"99:99:99\")","v":"99:99:99"},{"$f":"IF('TEMPS-poissy'!K11>0,'TEMPS-poissy'!K11-'TEMPS-poissy'!J11,\"\")","v":""},{"$f":"'TEMPS-poissy'!L11","v":"00:00:00"},{"$f":"IF('TEMPS-poissy'!K11>0,J11+K11,\"99:99:99\")","v":"99:99:99"},"00:00:00","00:00:00","00:00:00","00:00:00","00:00:00","00:00:00","00:00:00","00:00:00"]
[{"$f":"'TEMPS-ponton'!A12","v":8},{"$f":"'TEMPS-ponton'!B12","v":"JOINVILLE AMJ 1"},{"$f":"'TEMPS-ponton'!C12","v":"Joinville"},{"$f":"'TEMPS-ponton'!D12","v":"Laurent BAUDOIN-Raphaelle BOUVIER FLORY-Sophie BUSTOS-Kastriot JAKA-Thomas AUGER"},{"$f":"VLOOKUP(A12,Equipes!A:J,2,FALSE)","v":"M"},{"$f":"ROUND(VLOOKUP(A12,Equipes!$A$2:$J$41,10,0),0)","v":46},{"$f":"IF('TEMPS-poissy'!H12>0,'TEMPS-poissy'!H12-'TEMPS-poissy'!G12,\"\")","v":""},{"$f":"'TEMPS-poissy'!I12","v":"00:00:00"},{"$f":"IF('TEMPS-poissy'!H12>0,G12+H12,\"99:99:99\")","v":"99:99:99"},{"$f":"IF('TEMPS-poissy'!K12>0,'TEMPS-poissy'!K12-'TEMPS-poissy'!J12,\"\")","v":""},{"$f":"'TEMPS-poissy'!L12","v":"00:00:00"},{"$f":"IF('TEMPS-poissy'!K12>0,J12+K12,\"99:99:99\")","v":"99:99:99"},"00:00:00","00:00:00","00:00:00","00:00:00","00:00:00","00:00:00","00:00:00","00:00:00"]
[{"$f":"'TEMPS-ponton'!A13","v":9},{"$f":"'TEMPS-ponton'!B13","v":"NOGENT SUR MARNE CN 1"},{"$f":"'TEMPS-ponton'!C13","v":"CN 1"},{"$f":"'TEMPS-ponton'!D13","v":"Chrystelle SUPIOT-Caroline PIEDNOIRE-Olivier MUCIGNAT-Andre SIMONNET-Fabienne LORTIE"},{"$f":"VLOOKUP(A13,Equipes!A:J,2,FALSE)","v":"M"},{"$f":"ROUND(VLOOKUP(A13,Equipes!$A$2:$J$41,10,0),0)","v":53},{"$f":"IF('TEMPS-poissy'!H13>0,'TEMPS-poissy'!H13-'TEMPS-poissy'!G13,\"\")","v":""},{"$f":"'TEMPS-poissy'!I13","v":"00:00:00"},{"$f":"IF('TEMPS-poissy'!H13>0,G13+H13,\"99:99:99\")","v":"99:99:99"},{"$f":"IF('TEMPS-poissy'!K13>0,'TEMPS-poissy'!K13-'TEMPS-poissy'!J13,\"\")","v":""},{"$f":"'TEMPS-poissy'!L13","v":"00:00:00"},{"$f":"IF('TEMPS-poissy'!K13>0,J13+K13,\"99:99:99\")","v":"99:99:99"},{"$f":"SUM(N13:T13)","v":"00:00:00"},"00:00:00","00:00:00","00:00:00","00:00:00","00:00:00","00:00:00","00:00:00"]
[{"$f":"'TEMPS-ponton'!A14","v":10},{"$f":"'TEMPS-ponton'!B14","v":"NOGENT SUR MARNE CN 2"},{"$f":"'TEMPS-ponton'!C14","v":"CN2"},{"$f":"'TEMPS-ponton'!D14","v":"Christophe RUCKEBUSCH-Nicolas BURCKHART-Alice GHEERBRANT-Aurelie DONVAL-Gerard LECA"},{"$f":"VLOOKUP(A14,Equipes!A:J,2,FALSE)","v":"M"},{"$f":"ROUND(VLOOKUP(A14,Equipes!$A$2:$J$41,10,0),0)","v":53},{"$f":"IF('TEMPS-poissy'!H14>0,'TEMPS-poissy'!H14-'TEMPS-poissy'!G14,\"\")","v":""},{"$f":"'TEMPS-poissy'!I14","v":"00:00:00"},{"$f":"IF('TEMPS-poissy'!H14>0,G14+H14,\"99:99:99\")","v":"99:99:99"},{"$f":"IF('TEMPS-poissy'!K14>0,'TEMPS-poissy'!K14-'TEMPS-poissy'!J14,\"\")","v":""},{"$f":"'TEMPS-poissy'!L14","v":"00:00:00"},{"$f":"IF('TEMPS-poissy'!K14>0,J14+K14,\"99:99:99\")","v":"99:99:99"},"00:00:00","00:00:00","00:00:00","00:00:00","00:00:00","00:00:00","00:00:00","00:00:00"]
[{"$f":"'TEMPS-ponton'!A15","v":11},{"$f":"'TEMPS-ponton'!B15","v":"BOULOGNE 92 1"},{"$f":"'TEMPS-ponton'!C15","v":"ACBB"},{"$f":"'TEMPS-ponton'!D15","v":"Viviane BALLOY-Timothé BAZIRIES-Alexandre LE FUR-Sigrid PABST-Michel VEDRINE"},{"$f":"VLOOKUP(A15,Equipes!A:J,2,FALSE)","v":"H"},{"$f":"ROUND(VLOOKUP(A15,Equipes!$A$2:$J$41,10,0),0)","v":51},{"$f":"IF('TEMPS-poissy'!H15>0,'TEMPS-poissy'!H15-'TEMPS-poissy'!G15,\"\")","v":""},{"$f":"'TEMPS-poissy'!I15","v":"00:00:00"},{"$f":"IF('TEMPS-poissy'!H15>0,G15+H15,\"99:99:99\")","v":"99:99:99"},{"$f":"IF('TEMPS-poissy'!K15>0,'TEMPS-poissy'!K15-'TEMPS-poissy'!J15,\"\")","v":""},{"$f":"'TEMPS-poissy'!L15","v":"00:00:00"},{"$f":"IF('TEMPS-poissy'!K15>0,J15+K15,\"99:99:99\")","v":"99:99:99"},"00:00:00","00:00:00","00:00:00","00:00:00","00:00:00","00:00:00","00:00:00","00:00:00"]
[{"$f":"'TEMPS-ponton'!A16","v":12},{"$f":"'TEMPS-ponton'!B16","v":"EVRY SCA 2"},{"$f":"'TEMPS-ponton'!C16","v":"SCA2"},{"$f":"'TEMPS-ponton'!D16","v":"Laurent YEBOAH-Isabelle MOISSET FLEURISSON-Frederic DUCAUQUY-Sandrine GARCIA-Christelle MARTIN"},{"$f":"VLOOKUP(A16,Equipes!A:J,2,FALSE)","v":"M"},{"$f":"ROUND(VLOOKUP(A16,Equipes!$A$2:$J$41,10,0),0)","v":48},{"$f":"IF('TEMPS-poissy'!H16>0,'TEMPS-poissy'!H16-'TEMPS-poissy'!G16,\"\")","v":""},{"$f":"'TEMPS-poissy'!I16","v":"00:00:00"},{"$f":"IF('TEMPS-poissy'!H16>0,G16+H16,\"99:99:99\")","v":"99:99:99"},{"$f":"IF('TEMPS-poissy'!K16>0,'TEMPS-poissy'!K16-'TEMPS-poissy'!J16,\"\")","v":""},{"$f":"'TEMPS-poissy'!L16","v":"00:00:00"},{"$f":"IF('TEMPS-poissy'!K16>0,J16+K16,\"99:99:99\")","v":"99:99:99"},"00:05:00","00:05:00","00:00:00","00:00:00","00:00:00","00:00:00","00:00:00","00:00:00"]
[{"$f":"'TEMPS-ponton'!A17","v":13},{"$f":"'TEMPS-ponton'!B17","v":"PORT-MARLY RC 2"},{"$f":"'TEMPS-ponton'!C17","v":"RCPM2"},{"$f":"'TEMPS-ponton'!D17","v":"Elsa CROZATIER-Cyrielle BERTHIER-Hervé Valette-Eric MOINARD-Anais FEUGA"},{"$f":"VLOOKUP(A17,Equipes!A:J,2,FALSE)","v":"M"},{"$f":"ROUND(VLOOKUP(A17,Equipes!$A$2:$J$41,10,0),0)","v":47},{"$f":"IF('TEMPS-poissy'!H17>0,'TEMPS-poissy'!H17-'TEMPS-poissy'!G17,\"\")","v":""},{"$f":"'TEMPS-poissy'!I17","v":"00:00:00"},{"$f":"IF('TEMPS-poissy'!H17>0,G17+H17,\"99:99:99\")","v":"99:99:99"},{"$f":"IF('TEMPS-poissy'!K17>0,'TEMPS-poissy'!K17-'TEMPS-poissy'!J17,\"\")","v":""},{"$f":"'TEMPS-poissy'!L17","v":"00:00:00"},{"$f":"IF('TEMPS-poissy'!K17>0,J17+K17,\"99:99:99\")","v":"99:99:99"},"00:05:00","00:05:00","00:00:00","00:00:00","00:00:00","00:00:00","00:00:00","00:00:00"]
[{"$f":"'TEMPS-ponton'!A18","v":14},{"$f":"'TEMPS-ponton'!B18","v":"MAISONS MESNIL CERAMM 1"},{"$f":"'TEMPS-ponton'!C18","v":"CERAMM1"},{"$f":"'TEMPS-ponton'!D18","v":"Nicolas SCHMITT-Gloria VENDRELL-Christine MARIE LAVAUD-Amaury DE LA LAURENCIE-Amina ELABBADI"},{"$f":"VLOOKUP(A18,Equipes!A:J,2,FALSE)","v":"M"},{"$f":"ROUND(VLOOKUP(A18,Equipes!$A$2:$J$41,10,0),0)","v":50},{"$f":"IF('TEMPS-poissy'!H18>0,'TEMPS-poissy'!H18-'TEMPS-poissy'!G18,\"\")","v":""},{"$f":"'TEMPS-poissy'!I18","v":"00:00:00"},{"$f":"IF('TEMPS-poissy'!H18>0,G18+H18,\"99:99:99\")","v":"99:99:99"},{"$f":"IF('TEMPS-poissy'!K18>0,'TEMPS-poissy'!K18-'TEMPS-poissy'!J18,\"\")","v":""},{"$f":"'TEMPS-poissy'!L18","v":"00:00:00"},{"$f":"IF('TEMPS-poissy'!K18>0,J18+K18,\"99:99:99\")","v":"99:99:99"},"00:00:00","00:00:00","00:00:00","00:00:00","00:00:00","00:00:00","00:00:00","00:00:00"]
[{"$f":"'TEMPS-ponton'!A19","v":15},{"$f":"'TEMPS-ponton'!B19","v":"SOISY SUR SEINE CN 1"},{"$f":"'TEMPS-ponton'!C19","v":"CN1"},{"$f":"'TEMPS-ponton'!D19","v":"Bertrand PIOGER-Bruno PERIQUOI-Servane BERTRAND-Alain BERNARD-Robert TRAUET"},{"$f":"VLOOKUP(A19,Equipes!A:J,2,FALSE)","v":"H"},{"$f":"ROUND(VLOOKUP(A19,Equipes!$A$2:$J$41,10,0),0)","v":54},{"$f":"IF('TEMPS-poissy'!H19>0,'TEMPS-poissy'!H19-'TEMPS-poissy'!G19,\"\")","v":""},{"$f":"'TEMPS-poissy'!I19","v":"00:00:00"},{"$f":"IF('TEMPS-poissy'!H19>0,G19+H19,\"99:99:99\")","v":"99:99:99"},{"$f":"IF('TEMPS-poissy'!K19>0,'TEMPS-poissy'!K19-'TEMPS-poissy'!J19,\"\")","v":""},{"$f":"'TEMPS-poissy'!L19","v":"00:00:00"},{"$f":"IF('TEMPS-poissy'!K19>0,J19+K19,\"99:99:99\")","v":"99:99:99"},"00:05:00","00:00:00","00:00:00","00:00:00","00:05:00","00:00:00","00:00:00","00:00:00"]
[{"$f":"'TEMPS-ponton'!A20","v":16},{"$f":"'TEMPS-ponton'!B20","v":"PORT-MARLY RC 1"},{"$f":"'TEMPS-ponton'!C20","v":"RCPM1"},{"$f":"'TEMPS-ponton'!D20","v":"Jean-Claude LAFOREST-David CHARTIER-Christophe MARCAIS-Vincent BONTOUX-Alain ROUSSEAU"},{"$f":"VLOOKUP(A20,Equipes!A:J,2,FALSE)","v":"H"},{"$f":"ROUND(VLOOKUP(A20,Equipes!$A$2:$J$41,10,0),0)","v":55},{"$f":"IF('TEMPS-poissy'!H20>0,'TEMPS-poissy'!H20-'TEMPS-poissy'!G20,\"\")","v":""},{"$f":"'TEMPS-poissy'!I20","v":"00:00:00"},{"$f":"IF('TEMPS-poissy'!H20>0,G20+H20,\"99:99:99\")","v":"99:99:99"},{"$f":"IF('TEMPS-poissy'!K20>0,'TEMPS-poissy'!K20-'TEMPS-poissy'!J20,\"\")","v":""},{"$f":"'TEMPS-poissy'!L20","v":"00:00:00"},{"$f":"IF('TEMPS-poissy'!K20>0,J20+K20,\"99:99:99\")","v":"99:99:99"},"00:05:00","00:00:00","00:00:00","00:00:00","00:05:00","00:00:00","00:00:00","00:00:00"]
[{"$f":"'TEMPS-ponton'!A21","v":17},{"$f":"'TEMPS-ponton'!B21","v":"ANDRESY CA CONFLUENT 1"},{"$f":"'TEMPS-ponton'!C21","v":"CAC1"},{"$f":"'TEMPS-ponton'!D21","v":"Daphne PARIZOT-Agnes BURGHGRAEVE SELLEN-Sylvie FRANSSEN-Severine LEGAILLARD-Martine LE ROUX"},{"$f":"VLOOKUP(A21,Equipes!A:J,2,FALSE)","v":"F"},{"$f":"ROUND(VLOOKUP(A21,Equipes!$A$2:$J$41,10,0),0)","v":55},{"$f":"IF('TEMPS-poissy'!H21>0,'TEMPS-poissy'!H21-'TEMPS-poissy'!G21,\"\")","v":""},{"$f":"'TEMPS-poissy'!I21","v":"00:00:00"},{"$f":"IF('TEMPS-poissy'!H21>0,G21+H21,\"99:99:99\")","v":"99:99:99"},{"$f":"IF('TEMPS-poissy'!K21>0,'TEMPS-poissy'!K21-'TEMPS-poissy'!J21,\"\")","v":""},{"$f":"'TEMPS-poissy'!L21","v":"00:00:00"},{"$f":"IF('TEMPS-poissy'!K21>0,J21+K21,\"99:99:99\")","v":"99:99:99"},{"$f":"SUM(N21:T21)","v":"00:00:00"},"00:00:00","00:00:00","00:00:00","00:00:00","00:00:00","00:00:00","00:00:00"]
[{"$f":"'TEMPS-ponton'!A22","v":18},{"$f":"'TEMPS-ponton'!B22","v":"MAISONS MESNIL CERAMM 2"},{"$f":"'TEMPS-ponton'!C22","v":"CERAMM2"},{"$f":"'TEMPS-ponton'!D22","v":"Claude LEMENAGER-Didier GIRARDEAU-Laurent LIBOTTE-Alain GIRARD-Cecile JEAMMES"},{"$f":"VLOOKUP(A22,Equipes!A:J,2,FALSE)","v":"H"},{"$f":"ROUND(VLOOKUP(A22,Equipes!$A$2:$J$41,10,0),0)","v":58},{"$f":"IF('TEMPS-poissy'!H22>0,'TEMPS-poissy'!H22-'TEMPS-poissy'!G22,\"\")","v":""},{"$f":"'TEMPS-poissy'!I22","v":"00:00:00"},{"$f":"IF('TEMPS-poissy'!H22>0,G22+H22,\"99:99:99\")","v":"99:99:99"},{"$f":"IF('TEMPS-poissy'!K22>0,'TEMPS-poissy'!K22-'TEMPS-poissy'!J22,\"\")","v":""},{"$f":"'TEMPS-poissy'!L22","v":"00:00:00"},{"$f":"IF('TEMPS-poissy'!K22>0,J22+K22,\"99:99:99\")","v":"99:99:99"},"00:00:00","00:00:00","00:00:00","00:00:00","00:00:00","00:00:00","00:00:00","00:00:00"]
[{"$f":"'TEMPS-ponton'!A23","v":19},{"$f":"'TEMPS-ponton'!B23","v":"VILLENNES - POISSY AC 1"},{"$f":"'TEMPS-ponton'!C23","v":"ACVP1"},{"$f":"'TEMPS-ponton'!D23","v":"Olivier POLGE-Odile POLGE-Laurent BONHOMMET-Antoine VOLPI-Philippe STROHM"},{"$f":"VLOOKUP(A23,Equipes!A:J,2,FALSE)","v":"H"},{"$f":"ROUND(VLOOKUP(A23,Equipes!$A$2:$J$41,10,0),0)","v":55},{"$f":"IF('TEMPS-poissy'!H23>0,'TEMPS-poissy'!H23-'TEMPS-poissy'!G23,\"\")","v":""},{"$f":"'TEMPS-poissy'!I23","v":"00:00:00"},{"$f":"IF('TEMPS-poissy'!H23>0,G23+H23,\"99:99:99\")","v":"99:99:99"},{"$f":"IF('TEMPS-poissy'!K23>0,'TEMPS-poissy'!K23-'TEMPS-poissy'!J23,\"\")","v":""},{"$f":"'TEMPS-poissy'!L23","v":"00:00:00"},{"$f":"IF('TEMPS-poissy'!K23>0,J23+K23,\"99:99:99\")","v":"99:99:99"},"00:00:00","00:00:00","00:00:00","00:00:00","00:00:00","00:00:00","00:00:00","00:00:00"]
[{"$f":"'TEMPS-ponton'!A24","v":20},{"$f":"'TEMPS-ponton'!B24","v":"ROUEN CNAR 1"},{"$f":"'TEMPS-ponton'!C24","v":"CNAR1"},{"$f":"'TEMPS-ponton'!D24","v":"Nathalie MOUSSET-Francois LAIR-Betty GESLAIN-Thierry DUCHESNE-Stephane MOUSSET"},{"$f":"VLOOKUP(A24,Equipes!A:J,2,FALSE)","v":"M"},{"$f":"ROUND(VLOOKUP(A24,Equipes!$A$2:$J$41,10,0),0)","v":55},{"$f":"IF('TEMPS-poissy'!H24>0,'TEMPS-poissy'!H24-'TEMPS-poissy'!G24,\"\")","v":""},{"$f":"'TEMPS-poissy'!I24","v":"00:00:00"},{"$f":"IF('TEMPS-poissy'!H24>0,G24+H24,\"99:99:99\")","v":"99:99:99"},{"$f":"IF('TEMPS-poissy'!K24>0,'TEMPS-poissy'!K24-'TEMPS-poissy'!J24,\"\")","v":""},{"$f":"'TEMPS-poissy'!L24","v":"00:00:00"},{"$f":"IF('TEMPS-poissy'!K24>0,J24+K24,\"99:99:99\")","v":"99:99:99"},{"$f":"SUM(N24:T24)","v":"00:00:00"},"00:00:00","00:00:00","00:00:00","00:00:00","00:00:00","00:00:00","00:00:00"]
[{"$f":"'TEMPS-ponton'!A25","v":21},{"$f":"'TEMPS-ponton'!B25","v":"PORT-MARLY RC 2"},{"$f":"'TEMPS-ponton'!C25","v":"RCPM2"},{"$f":"'TEMPS-ponton'!D25","v":"Guillaume CHARRON-Philippe VERHE-Stephan REYNIER-Dominique LEROUX-Luciano AUTUNNALE"},{"$f":"VLOOKUP(A25,Equipes!A:J,2,FALSE)","v":"H"},{"$f":"ROUND(VLOOKUP(A25,Equipes!$A$2:$J$41,10,0),0)","v":51},{"$f":"IF('TEMPS-poissy'!H25>0,'TEMPS-poissy'!H25-'TEMPS-poissy'!G25,\"\")","v":""},{"$f":"'TEMPS-poissy'!I25","v":"00:00:00"},{"$f":"IF('TEMPS-poissy'!H25>0,G25+H25,\"99:99:99\")","v":"99:99:99"},{"$f":"IF('TEMPS-poissy'!K25>0,'TEMPS-poissy'!K25-'TEMPS-poissy'!J25,\"\")","v":""},{"$f":"'TEMPS-poissy'!L25","v":"00:00:00"},{"$f":"IF('TEMPS-poissy'!K25>0,J25+K25,\"99:99:99\")","v":"99:99:99"},"00:00:00","00:00:00","00:00:00","00:00:00","00:00:00","00:00:00","00:00:00","00:00:00"]
[{"$f":"'TEMPS-ponton'!A26","v":22},{"$f":"'TEMPS-ponton'!B26","v":"COUDRAY MONTCEAUX A 1"},{"$f":"'TEMPS-ponton'!C26","v":"coudray1"},{"$f":"'TEMPS-ponton'!D26","v":"Joseph RAYNAUD-Frederic MORAT-Benjamin HOUILLON-Pascal BEAUSSART-Anne HOUAL"},{"$f":"VLOOKUP(A26,Equipes!A:J,2,FALSE)","v":"H"},{"$f":"ROUND(VLOOKUP(A26,Equipes!$A$2:$J$41,10,0),0)","v":52},{"$f":"IF('TEMPS-poissy'!H26>0,'TEMPS-poissy'!H26-'TEMPS-poissy'!G26,\"\")","v":""},{"$f":"'TEMPS-poissy'!I26","v":"00:00:00"},{"$f":"IF('TEMPS-poissy'!H26>0,G26+H26,\"99:99:99\")","v":"99:99:99"},{"$f":"IF('TEMPS-poissy'!K26>0,'TEMPS-poissy'!K26-'TEMPS-poissy'!J26,\"\")","v":""},{"$f":"'TEMPS-poissy'!L26","v":"00:00:00"},{"$f":"IF('TEMPS-poissy'!K26>0,J26+K26,\"99:99:99\")","v":"99:99:99"},"00:00:00","00:00:00","00:00:00","00:00:00","00:00:00","00:00:00","00:00:00","00:00:00"]
[{"$f":"'TEMPS-ponton'!A27","v":23},{"$f":"'TEMPS-ponton'!B27","v":"SN OISE 1"},{"$f":"'TEMPS-ponton'!C27","v":"SN Oise 1\n"},{"$f":"'TEMPS-ponton'!D27","v":"Agnes AUDEBERT-Nicolas RAUCH-Jerome ROUGE-Nathalie BAUDIER-Isabelle JOUBERT"},{"$f":"VLOOKUP(A27,Equipes!A:J,2,FALSE)","v":"M"},{"$f":"ROUND(VLOOKUP(A27,Equipes!$A$2:$J$41,10,0),0)","v":50},{"$f":"IF('TEMPS-poissy'!H27>0,'TEMPS-poissy'!H27-'TEMPS-poissy'!G27,\"\")","v":""},{"$f":"'TEMPS-poissy'!I27","v":"00:00:00"},{"$f":"IF('TEMPS-poissy'!H27>0,G27+H27,\"99:99:99\")","v":"99:99:99"},{"$f":"IF('TEMPS-poissy'!K27>0,'TEMPS-poissy'!K27-'TEMPS-poissy'!J27,\"\")","v":""},{"$f":"'TEMPS-poissy'!L27","v":"00:00:00"},{"$f":"IF('TEMPS-poissy'!K27>0,J27+K27,\"99:99:99\")","v":"99:99:99"},"00:00:00","00:00:00","00:00:00","00:00:00","00:00:00","00:00:00","00:00:00","00:00:00"]
[{"$f":"'TEMPS-ponton'!A28","v":24},{"$f":"'TEMPS-ponton'!B28","v":"MEULAN LES MUREAUX AMMH 1"},{"$f":"'TEMPS-ponton'!C28","v":"AMMH1"},{"$f":"'TEMPS-ponton'!D28","v":"Xavier MARSAIS-Eric PRENEY-Yannick DAGMEY-David COINE-Arthur VAN SLOOTEN"},{"$f":"VLOOKUP(A28,Equipes!A:J,2,FALSE)","v":"H"},{"$f":"ROUND(VLOOKUP(A28,Equipes!$A$2:$J$41,10,0),0)","v":53},{"$f":"IF('TEMPS-poissy'!H28>0,'TEMPS-poissy'!H28-'TEMPS-poissy'!G28,\"\")","v":""},{"$f":"'TEMPS-poissy'!I28","v":"00:00:00"},{"$f":"IF('TEMPS-poissy'!H28>0,G28+H28,\"99:99:99\")","v":"99:99:99"},{"$f":"IF('TEMPS-poissy'!K28>0,'TEMPS-poissy'!K28-'TEMPS-poissy'!J28,\"\")","v":""},{"$f":"'TEMPS-poissy'!L28","v":"00:00:00"},{"$f":"IF('TEMPS-poissy'!K28>0,J28+K28,\"99:99:99\")","v":"99:99:99"},"00:00:00","00:00:00","00:00:00","00:00:00","00:00:00","00:00:00","00:00:00","00:00:00"]
[{"$f":"'TEMPS-ponton'!A29","v":25},{"$f":"'TEMPS-ponton'!B29","v":"VILLENNES - POISSY AC 2"},{"$f":"'TEMPS-ponton'!C29","v":"ACVP2"},{"$f":"'TEMPS-ponton'!D29","v":"Franck CARIOU-Michael LE BANNER-Valerie DECAESTECKER-Karine GUILBON-Christophe ELINE"},{"$f":"VLOOKUP(A29,Equipes!A:J,2,FALSE)","v":"M"},{"$f":"ROUND(VLOOKUP(A29,Equipes!$A$2:$J$41,10,0),0)","v":54},{"$f":"IF('TEMPS-poissy'!H29>0,'TEMPS-poissy'!H29-'TEMPS-poissy'!G29,\"\")","v":""},{"$f":"'TEMPS-poissy'!I29","v":"00:00:00"},{"$f":"IF('TEMPS-poissy'!H29>0,G29+H29,\"99:99:99\")","v":"99:99:99"},{"$f":"IF('TEMPS-poissy'!K29>0,'TEMPS-poissy'!K29-'TEMPS-poissy'!J29,\"\")","v":""},{"$f":"'TEMPS-poissy'!L29","v":"00:00:00"},{"$f":"IF('TEMPS-poissy'!K29>0,J29+K29,\"99:99:99\")","v":"99:99:99"},"00:00:00","00:00:00","00:00:00","00:00:00","00:00:00","00:00:00","00:00:00","00:00:00"]
[{"$f":"'TEMPS-ponton'!A30","v":26},{"$f":"'TEMPS-ponton'!B30","v":"EVRY SCA 1"},{"$f":"'TEMPS-ponton'!C30","v":"SCA 1"},{"$f":"'TEMPS-ponton'!D30","v":"Anne CARDUNER-Olivia PEZZOLI-Bruno CASIMIR-Lionel BOISSONNAT-Kristell MAUCHET"},{"$f":"VLOOKUP(A30,Equipes!A:J,2,FALSE)","v":"M"},{"$f":"ROUND(VLOOKUP(A30,Equipes!$A$2:$J$41,10,0),0)","v":56},{"$f":"IF('TEMPS-poissy'!H30>0,'TEMPS-poissy'!H30-'TEMPS-poissy'!G30,\"\")","v":""},{"$f":"'TEMPS-poissy'!I30","v":"00:00:00"},{"$f":"IF('TEMPS-poissy'!H30>0,G30+H30,\"99:99:99\")","v":"99:99:99"},{"$f":"IF('TEMPS-poissy'!K30>0,'TEMPS-poissy'!K30-'TEMPS-poissy'!J30,\"\")","v":""},{"$f":"'TEMPS-poissy'!L30","v":"00:00:00"},{"$f":"IF('TEMPS-poissy'!K30>0,J30+K30,\"99:99:99\")","v":"99:99:99"},"00:00:00","00:00:00","00:00:00","00:00:00","00:00:00","00:00:00","00:00:00","00:00:00"]
[{"$f":"'TEMPS-ponton'!A31","v":27},{"$f":"'TEMPS-ponton'!B31","v":"MEULAN LES MUREAUX AMMH 1"},{"$f":"'TEMPS-ponton'!C31","v":"AMMH1"},{"$f":"'TEMPS-ponton'!D31","v":"Gwenaelle MARSAIS-Sophie SEFFAR-Catherine MARTINIER-Christelle GOANVIC-Marie LAMORE"},{"$f":"VLOOKUP(A31,Equipes!A:J,2,FALSE)","v":"F"},{"$f":"ROUND(VLOOKUP(A31,Equipes!$A$2:$J$41,10,0),0)","v":47},{"$f":"IF('TEMPS-poissy'!H31>0,'TEMPS-poissy'!H31-'TEMPS-poissy'!G31,\"\")","v":""},{"$f":"'TEMPS-poissy'!I31","v":"00:00:00"},{"$f":"IF('TEMPS-poissy'!H31>0,G31+H31,\"99:99:99\")","v":"99:99:99"},{"$f":"IF('TEMPS-poissy'!K31>0,'TEMPS-poissy'!K31-'TEMPS-poissy'!J31,\"\")","v":""},{"$f":"'TEMPS-poissy'!L31","v":"00:00:00"},{"$f":"IF('TEMPS-poissy'!K31>0,J31+K31,\"99:99:99\")","v":"99:99:99"},"00:00:00","00:00:00","00:00:00","00:00:00","00:00:00","00:00:00","00:00:00","00:00:00"]
[{"$f":"'TEMPS-ponton'!A32","v":28},{"$f":"'TEMPS-ponton'!B32","v":"VILLENNES - POISSY AC 1"},{"$f":"'TEMPS-ponton'!C32","v":"ACVP1"},{"$f":"'TEMPS-ponton'!D32","v":"Frederic LE ROUX-Corinne HUARD-ROLLAND-Elodie DEREMIENCE-Marie-Claude LAUNAY-Olivier COSNEAU"},{"$f":"VLOOKUP(A32,Equipes!A:J,2,FALSE)","v":"M"},{"$f":"ROUND(VLOOKUP(A32,Equipes!$A$2:$J$41,10,0),0)","v":53},{"$f":"IF('TEMPS-poissy'!H32>0,'TEMPS-poissy'!H32-'TEMPS-poissy'!G32,\"\")","v":""},{"$f":"'TEMPS-poissy'!I32","v":"00:00:00"},{"$f":"IF('TEMPS-poissy'!H32>0,G32+H32,\"99:99:99\")","v":"99:99:99"},{"$f":"IF('TEMPS-poissy'!K32>0,'TEMPS-poissy'!K32-'TEMPS-poissy'!J32,\"\")","v":""},{"$f":"'TEMPS-poissy'!L32","v":"00:00:00"},{"$f":"IF('TEMPS-poissy'!K32>0,J32+K32,\"99:99:99\")","v":"99:99:99"},"00:00:00","00:00:00","00:00:00","00:00:00","00:00:00","00:00:00","00:00:00","00:00:00"]
[{"$f":"'TEMPS-ponton'!A33","v":29},{"$f":"'TEMPS-ponton'!B33","v":"FONTAINEBLEAU APF 1"},{"$f":"'TEMPS-ponton'!C33","v":"APF1"},{"$f":"'TEMPS-ponton'!D33","v":"Kathleen SANCHEZ-Laurent FOUQUE-Christian MESSALES-Denis FLORY-David WEBER"},{"$f":"VLOOKUP(A33,Equipes!A:J,2,FALSE)","v":"H"},{"$f":"ROUND(VLOOKUP(A33,Equipes!$A$2:$J$41,10,0),0)","v":57},{"$f":"IF('TEMPS-poissy'!H33>0,'TEMPS-poissy'!H33-'TEMPS-poissy'!G33,\"\")","v":""},{"$f":"'TEMPS-poissy'!I33","v":"00:00:00"},{"$f":"IF('TEMPS-poissy'!H33>0,G33+H33,\"99:99:99\")","v":"99:99:99"},{"$f":"IF('TEMPS-poissy'!K33>0,'TEMPS-poissy'!K33-'TEMPS-poissy'!J33,\"\")","v":""},{"$f":"'TEMPS-poissy'!L33","v":"00:00:00"},{"$f":"IF('TEMPS-poissy'!K33>0,J33+K33,\"99:99:99\")","v":"99:99:99"},"00:00:00","00:00:00","00:00:00","00:00:00","00:00:00","00:00:00","00:00:00","00:00:00"]
[{"$f":"'TEMPS-ponton'!A34","v":30},{"$f":"'TEMPS-ponton'!B34","v":"JOINVILLE AMJ 1"},{"$f":"'TEMPS-ponton'!C34","v":"AMJ1"},{"$f":"'TEMPS-ponton'!D34","v":"Vincent FABIEN-Arnaud PUPPO-Jonathan ROOKE-Xavier SUCHET-Nicolas JAMAULT"},{"$f":"VLOOKUP(A34,Equipes!A:J,2,FALSE)","v":"H"},{"$f":"ROUND(VLOOKUP(A34,Equipes!$A$2:$J$41,10,0),0)","v":51},{"$f":"IF('TEMPS-poissy'!H34>0,'TEMPS-poissy'!H34-'TEMPS-poissy'!G34,\"\")","v":""},{"$f":"'TEMPS-poissy'!I34","v":"00:00:00"},{"$f":"IF('TEMPS-poissy'!H34>0,G34+H34,\"99:99:99\")","v":"99:99:99"},{"$f":"IF('TEMPS-poissy'!K34>0,'TEMPS-poissy'!K34-'TEMPS-poissy'!J34,\"\")","v":""},{"$f":"'TEMPS-poissy'!L34","v":"00:00:00"},{"$f":"IF('TEMPS-poissy'!K34>0,J34+K34,\"99:99:99\")","v":"99:99:99"},"00:05:00","00:00:00","00:00:00","00:00:00","00:05:00","00:00:00","00:00:00","00:00:00"]
[{"$f":"'TEMPS-ponton'!A35","v":31},{"$f":"'TEMPS-ponton'!B35","v":"NOGENT SUR MARNE CN 3"},{"$f":"'TEMPS-ponton'!C35","v":"CN3"},{"$f":"'TEMPS-ponton'!D35","v":"Alexandra COHEN SALMON-Isabelle MILON-BANNEROT-Jerome TROMBOFSKY-Olivier PASCAL-Elisabeth LAUNAY"},{"$f":"VLOOKUP(A35,Equipes!A:J,2,FALSE)","v":"M"},{"$f":"ROUND(VLOOKUP(A35,Equipes!$A$2:$J$41,10,0),0)","v":53},{"$f":"IF('TEMPS-poissy'!H35>0,'TEMPS-poissy'!H35-'TEMPS-poissy'!G35,\"\")","v":""},{"$f":"'TEMPS-poissy'!I35","v":"00:00:00"},{"$f":"IF('TEMPS-poissy'!H35>0,G35+H35,\"99:99:99\")","v":"99:99:99"},{"$f":"IF('TEMPS-poissy'!K35>0,'TEMPS-poissy'!K35-'TEMPS-poissy'!J35,\"\")","v":""},{"$f":"'TEMPS-poissy'!L35","v":"00:00:00"},{"$f":"IF('TEMPS-poissy'!K35>0,J35+K35,\"99:99:99\")","v":"99:99:99"},"00:00:00","00:00:00","00:00:00","00:00:00","00:00:00","00:00:00","00:00:00","00:00:00"]
[{"$f":"'TEMPS-ponton'!A36","v":32},{"$f":"'TEMPS-ponton'!B36","v":"BOULOGNE 92 1"},{"$f":"'TEMPS-ponton'!C36","v":"ACBB1"},{"$f":"'TEMPS-ponton'!D36","v":"Isabelle MAIRE-Théo BEL BERBEL- LURBE-Thã‰Odore SEDAROS-Omar OUAZZANI-Alexandra MENEZES"},{"$f":"VLOOKUP(A36,Equipes!A:J,2,FALSE)","v":"H"},{"$f":"ROUND(VLOOKUP(A36,Equipes!$A$2:$J$41,10,0),0)","v":43},{"$f":"IF('TEMPS-poissy'!H36>0,'TEMPS-poissy'!H36-'TEMPS-poissy'!G36,\"\")","v":""},{"$f":"'TEMPS-poissy'!I36","v":"00:00:00"},{"$f":"IF('TEMPS-poissy'!H36>0,G36+H36,\"99:99:99\")","v":"99:99:99"},{"$f":"IF('TEMPS-poissy'!K36>0,'TEMPS-poissy'!K36-'TEMPS-poissy'!J36,\"\")","v":""},{"$f":"'TEMPS-poissy'!L36","v":"00:00:00"},{"$f":"IF('TEMPS-poissy'!K36>0,J36+K36,\"99:99:99\")","v":"99:99:99"},"00:00:00","00:00:00","00:00:00","00:00:00","00:00:00","00:00:00","00:00:00","00:00:00"]
[{"$f":"'TEMPS-ponton'!A37","v":33},{"$f":"'TEMPS-ponton'!B37","v":"XX"},{"$f":"'TEMPS-ponton'!C37","v":"XX"},{"$f":"'TEMPS-ponton'!D37","v":"XX-XX-XX-XX-XX"},{"$f":"VLOOKUP(A37,Equipes!A:J,2,FALSE)","v":"X"},{"$f":"ROUND(VLOOKUP(A37,Equipes!$A$2:$J$41,10,0),0)","v":0},{"$f":"IF('TEMPS-poissy'!H37>0,'TEMPS-poissy'!H37-'TEMPS-poissy'!G37,\"\")","v":""},{"$f":"'TEMPS-poissy'!I37","v":"00:00:00"},{"$f":"IF('TEMPS-poissy'!H37>0,G37+H37,\"99:99:99\")","v":"99:99:99"},{"$f":"IF('TEMPS-poissy'!K37>0,'TEMPS-poissy'!K37-'TEMPS-poissy'!J37,\"\")","v":""},{"$f":"'TEMPS-poissy'!L37","v":"00:00:00"},{"$f":"IF('TEMPS-poissy'!K37>0,J37+K37,\"99:99:99\")","v":"99:99:99"},"00:00:00","00:00:00","00:00:00","00:00:00","00:00:00","00:00:00","00:00:00","00:00:00"]
[{"$f":"'TEMPS-ponton'!A38","v":34},{"$f":"'TEMPS-ponton'!B38","v":"XX"},{"$f":"'TEMPS-ponton'!C38","v":"XX"},{"$f":"'TEMPS-ponton'!D38","v":"XX-XX-XX-XX-XX"},{"$f":"VLOOKUP(A38,Equipes!A:J,2,FALSE)","v":"X"},{"$f":"ROUND(VLOOKUP(A38,Equipes!$A$2:$J$41,10,0),0)","v":0},{"$f":"IF('TEMPS-poissy'!H38>0,'TEMPS-poissy'!H38-'TEMPS-poissy'!G38,\"\")","v":""},{"$f":"'TEMPS-poissy'!I38","v":"00:00:00"},{"$f":"IF('TEMPS-poissy'!H38>0,G38+H38,\"99:99:99\")","v":"99:99:99"},{"$f":"IF('TEMPS-poissy'!K38>0,'TEMPS-poissy'!K38-'TEMPS-poissy'!J38,\"\")","v":""},{"$f":"'TEMPS-poissy'!L38","v":"00:00:00"},{"$f":"IF('TEMPS-poissy'!K38>0,J38+K38,\"99:99:99\")","v":"99:99:99"},"00:00:00","00:00:00","00:00:00","00:00:00","00:00:00","00:00:00","00:00:00","00:00:00"]
[{"$f":"'TEMPS-ponton'!A39","v":35},{"$f":"'TEMPS-ponton'!B39","v":"XX"},{"$f":"'TEMPS-ponton'!C39","v":"XX"},{"$f":"'TEMPS-ponton'!D39","v":"XX-XX-XX-XX-XX"},{"$f":"VLOOKUP(A39,Equipes!A:J,2,FALSE)","v":"X"},{"$f":"ROUND(VLOOKUP(A39,Equipes!$A$2:$J$41,10,0),0)","v":0},{"$f":"IF('TEMPS-poissy'!H39>0,'TEMPS-poissy'!H39-'TEMPS-poissy'!G39,\"\")","v":""},{"$f":"'TEMPS-poissy'!I39","v":"00:00:00"},{"$f":"IF('TEMPS-poissy'!H39>0,G39+H39,\"99:99:99\")","v":"99:99:99"},{"$f":"IF('TEMPS-poissy'!K39>0,'TEMPS-poissy'!K39-'TEMPS-poissy'!J39,\"\")","v":""},{"$f":"'TEMPS-poissy'!L39","v":"00:00:00"},{"$f":"IF('TEMPS-poissy'!K39>0,J39+K39,\"99:99:99\")","v":"99:99:99"},"00:00:00","00:00:00","00:00:00","00:00:00","00:00:00","00:00:00","00:00:00","00:00:00"]
[{"$f":"'TEMPS-ponton'!A40","v":36},{"$f":"'TEMPS-ponton'!B40","v":"XX"},{"$f":"'TEMPS-ponton'!C40","v":"XX"},{"$f":"'TEMPS-ponton'!D40","v":"XX-XX-XX-XX-XX"},{"$f":"VLOOKUP(A40,Equipes!A:J,2,FALSE)","v":"X"},{"$f":"ROUND(VLOOKUP(A40,Equipes!$A$2:$J$41,10,0),0)","v":0},{"$f":"IF('TEMPS-poissy'!H40>0,'TEMPS-poissy'!H40-'TEMPS-poissy'!G40,\"\")","v":""},{"$f":"'TEMPS-poissy'!I40","v":"00:00:00"},{"$f":"IF('TEMPS-poissy'!H40>0,G40+H40,\"99:99:99\")","v":"99:99:99"},{"$f":"IF('TEMPS-poissy'!K40>0,'TEMPS-poissy'!K40-'TEMPS-poissy'!J40,\"\")","v":""},{"$f":"'TEMPS-poissy'!L40","v":"00:00:00"},{"$f":"IF('TEMPS-poissy'!K40>0,J40+K40,\"99:99:99\")","v":"99:99:99"},"00:00:00","00:00:00","00:00:00","00:00:00","00:00:00","00:00:00","00:00:00","00:00:00"]
[{"$f":"'TEMPS-ponton'!A41","v":37},{"$f":"'TEMPS-ponton'!B41","v":"XX"},{"$f":"'TEMPS-ponton'!C41","v":"XX"},{"$f":"'TEMPS-ponton'!D41","v":"XX-XX-XX-XX-XX"},{"$f":"VLOOKUP(A41,Equipes!A:J,2,FALSE)","v":"X"},{"$f":"ROUND(VLOOKUP(A41,Equipes!$A$2:$J$41,10,0),0)","v":0},{"$f":"IF('TEMPS-poissy'!H41>0,'TEMPS-poissy'!H41-'TEMPS-poissy'!G41,\"\")","v":""},{"$f":"'TEMPS-poissy'!I41","v":"00:00:00"},{"$f":"IF('TEMPS-poissy'!H41>0,G41+H41,\"99:99:99\")","v":"99:99:99"},{"$f":"IF('TEMPS-poissy'!K41>0,'TEMPS-poissy'!K41-'TEMPS-poissy'!J41,\"\")","v":""},{"$f":"'TEMPS-poissy'!L41","v":"00:00:00"},{"$f":"IF('TEMPS-poissy'!K41>0,J41+K41,\"99:99:99\")","v":"99:99:99"},"00:00:00","00:00:00","00:00:00","00:00:00","00:00:00","00:00:00","00:00:00","00:00:00"]
[{"$f":"'TEMPS-ponton'!A42","v":38},{"$f":"'TEMPS-ponton'!B42","v":"XX"},{"$f":"'TEMPS-ponton'!C42","v":"XX"},{"$f":"'TEMPS-ponton'!D42","v":"XX-XX-XX-XX-XX"},{"$f":"VLOOKUP(A42,Equipes!A:J,2,FALSE)","v":"X"},{"$f":"ROUND(VLOOKUP(A42,Equipes!$A$2:$J$41,10,0),0)","v":0},{"$f":"IF('TEMPS-poissy'!H42>0,'TEMPS-poissy'!H42-'TEMPS-poissy'!G42,\"\")","v":""},{"$f":"'TEMPS-poissy'!I42","v":"00:00:00"},{"$f":"IF('TEMPS-poissy'!H42>0,G42+H42,\"99:99:99\")","v":"99:99:99"},{"$f":"IF('TEMPS-poissy'!K42>0,'TEMPS-poissy'!K42-'TEMPS-poissy'!J42,\"\")","v":""},{"$f":"'TEMPS-poissy'!L42","v":"00:00:00"},{"$f":"IF('TEMPS-poissy'!K42>0,J42+K42,\"99:99:99\")","v":"99:99:99"},"00:00:00","00:00:00","00:00:00","00:00:00","00:00:00","00:00:00","00:00:00","00:00:00"]
[{"$f":"'TEMPS-ponton'!A43","v":39},{"$f":"'TEMPS-ponton'!B43","v":"XX"},{"$f":"'TEMPS-ponton'!C43","v":"XX"},{"$f":"'TEMPS-ponton'!D43","v":"XX-XX-XX-XX-XX"},{"$f":"VLOOKUP(A43,Equipes!A:J,2,FALSE)","v":"X"},{"$f":"ROUND(VLOOKUP(A43,Equipes!$A$2:$J$41,10,0),0)","v":0},{"$f":"IF('TEMPS-poissy'!H43>0,'TEMPS-poissy'!H43-'TEMPS-poissy'!G43,\"\")","v":""},{"$f":"'TEMPS-poissy'!I43","v":"00:00:00"},{"$f":"IF('TEMPS-poissy'!H43>0,G43+H43,\"99:99:99\")","v":"99:99:99"},{"$f":"IF('TEMPS-poissy'!K43>0,'TEMPS-poissy'!K43-'TEMPS-poissy'!J43,\"\")","v":""},{"$f":"'TEMPS-poissy'!L43","v":"00:00:00"},{"$f":"IF('TEMPS-poissy'!K43>0,J43+K43,\"99:99:99\")","v":"99:99:99"},"00:00:00","00:00:00","00:00:00","00:00:00","00:00:00","00:00:00","00:00:00","00:00:00"]
[{"$f":"'TEMPS-ponton'!A44","v":40},{"$f":"'TEMPS-ponton'!B44","v":"XX"},{"$f":"'TEMPS-ponton'!C44","v":"XX"},{"$f":"'TEMPS-ponton'!D44","v":"XX-XX-XX-XX-XX"},{"$f":"VLOOKUP(A44,Equipes!A:J,2,FALSE)","v":"X"},{"$f":"ROUND(VLOOKUP(A44,Equipes!$A$2:$J$41,10,0),0)","v":0},{"$f":"IF('TEMPS-poissy'!H44>0,'TEMPS-poissy'!H44-'TEMPS-poissy'!G44,\"\")","v":""},{"$f":"'TEMPS-poissy'!I44","v":"00:00:00"},{"$f":"IF('TEMPS-poissy'!H44>0,G44+H44,\"99:99:99\")","v":"99:99:99"},{"$f":"IF('TEMPS-poissy'!K44>0,'TEMPS-poissy'!K44-'TEMPS-poissy'!J44,\"\")","v":""},{"$f":"'TEMPS-poissy'!L44","v":"00:00:00"},{"$f":"IF('TEMPS-poissy'!K44>0,J44+K44,\"99:99:99\")","v":"99:99:99"},{"$f":"SUM(N44:T44)","v":"00:00:00"},"00:00:00","00:00:00","00:00:00","00:00:00","00:00:00","00:00:00","00:00:00"]

{"sheet":"Heures Pass","index":15,"n_rows":44,"n_cols":13,"rows_kept":44,"cut":false,"hidden":false,"merged":[[0,0,1,2],[0,3,1,3],[0,6,1,12]]}
["GRAND 8     ",null,null,{"$f":"'Note explicative fichier'!E3","v":"2024-06-02"},null,null,"Tableau des Heures de passages"]
[]
["Yolette N°","Club","Ville","Equipage ","Cat.","Moy. Age","Départ","Poissy-1","1 / 4\nG-8","1 / 2\nG-8","Poissy-2","3 / 4\nG-8","Arrivée"]
[{"$f":"'TEMPS-ponton'!A4","v":"Record"},{"$f":"'TEMPS-ponton'!B4","v":"POLYTECHNIQUE ( Référence 2012 )"},{"$f":"'TEMPS-ponton'!C4","v":"Palaiseau"},{"$f":"'TEMPS-ponton'!D4","v":"FERRERO Michel - Alexandre Rosinski - BOYAUD Mathieu - GODDE Olivier - THECKES Benoit"},null,null,{"$f":"'TEMPS-ponton'!G4","v":"08:46:30"},"00:00:00",{"$f":"'TEMPS-ponton'!H4","v":"09:10:05"},{"$f":"'TEMPS-ponton'!I4","v":"09:27:11"},"00:00:00",{"$f":"'TEMPS-ponton'!J4","v":"09:51:04"},{"$f":"'TEMPS-ponton'!K4","v":"10:08:18"}]
[{"$f":"'TEMPS-ponton'!A5","v":1},{"$f":"'TEMPS-ponton'!B5","v":"ANDRESY CA CONFLUENT 1"},{"$f":"'TEMPS-ponton'!C5","v":"Cac1"},{"$f":"'TEMPS-ponton'!D5","v":"Stephanie LAPORTE-Marine NACERI-Marc LACCASSAGNE-Stephane ZETTWOOG-Fouzia VOIRIN"},{"$f":"VLOOKUP(A5,Equipes!A:J,2,FALSE)","v":"M"},{"$f":"ROUND(VLOOKUP(A5,Equipes!$A$2:$J$41,10,0),0)","v":49},{"$f":"'TEMPS-ponton'!G5","v":"09:15:43"},{"$f":"'TEMPS-poissy'!G5","v":"00:00:00"},{"$f":"'TEMPS-ponton'!H5","v":"09:49:03"},{"$f":"'TEMPS-ponton'!I5","v":"10:13:40"},{"$f":"'TEMPS-poissy'!J5","v":"00:00:00"},{"$f":"'TEMPS-ponton'!J5","v":"10:43:29"},{"$f":"'TEMPS-ponton'!K5","v":"11:07:36"}]
[{"$f":"'TEMPS-ponton'!A6","v":2},{"$f":"'TEMPS-ponton'!B6","v":"CAUDEBEC EN CAUX ACVS 1"},{"$f":"'TEMPS-ponton'!C6","v":"Caudebec"},{"$f":"'TEMPS-ponton'!D6","v":"Martine NARBAIS-JAUREGUY-Caroline KERVRANN-Stephane DELAMARE-Nicolas BARRAY-Francois NARBAIS-JAUREGUY"},{"$f":"VLOOKUP(A6,Equipes!A:J,2,FALSE)","v":"M"},{"$f":"ROUND(VLOOKUP(A6,Equipes!$A$2:$J$41,10,0),0)","v":55},{"$f":"'TEMPS-ponton'!G6","v":"09:18:40"},{"$f":"'TEMPS-poissy'!G6","v":"00:00:00"},{"$f":"'TEMPS-ponton'!H6","v":"09:48:48"},{"$f":"'TEMPS-ponton'!I6","v":"10:11:02"},{"$f":"'TEMPS-poissy'!J6","v":"00:00:00"},{"$f":"'TEMPS-ponton'!J6","v":"10:40:10"},{"$f":"'TEMPS-ponton'!K6","v":"11:02:27"}]
[{"$f":"'TEMPS-ponton'!A7","v":3},{"$f":"'TEMPS-ponton'!B7","v":"ANDRESY CA CONFLUENT 2"},{"$f":"'TEMPS-ponton'!C7","v":"CAC 2"},{"$f":"'TEMPS-ponton'!D7","v":"Anna ALCALOIDEPOIXBLANC-Geoffrey GHIZZONI-Nathalie BOURGEOIS-Franck CHRISTIANNOT-NicOLAS delaunoy"},{"$f":"VLOOKUP(A7,Equipes!A:J,2,FALSE)","v":"M"},{"$f":"ROUND(VLOOKUP(A7,Equipes!$A$2:$J$41,10,0),0)","v":55},{"$f":"'TEMPS-ponton'!G7","v":"09:20:40"},{"$f":"'TEMPS-poissy'!G7","v":"00:00:00"},{"$f":"'TEMPS-ponton'!H7","v":"09:54:28"},{"$f":"'TEMPS-ponton'!I7","v":"10:21:29"},{"$f":"'TEMPS-poissy'!J7","v":"00:00:00"},{"$f":"'TEMPS-ponton'!J7","v":"10:52:53"},{"$f":"'TEMPS-ponton'!K7","v":"11:18:29"}]
[{"$f":"'TEMPS-ponton'!A8","v":4},{"$f":"'TEMPS-ponton'!B8","v":"ANDRESY CA CONFLUENT 1"},{"$f":"'TEMPS-ponton'!C8","v":"CAC3"},{"$f":"'TEMPS-ponton'!D8","v":"Emmanuel SALIN-Ousseni PARKOUDA-Jean-Baptiste PROVENZANO-Jerome CLAVE-Julian GALLELA"},{"$f":"VLOOKUP(A8,Equipes!A:J,2,FALSE)","v":"H"},{"$f":"ROUND(VLOOKUP(A8,Equipes!$A$2:$J$41,10,0),0)","v":46},{"$f":"'TEMPS-ponton'!G8","v":"09:22:41"},{"$f":"'TEMPS-poissy'!G8","v":"00:00:00"},{"$f":"'TEMPS-ponton'!H8","v":"09:52:26"},{"$f":"'TEMPS-ponton'!I8","v":"10:16:29"},{"$f":"'TEMPS-poissy'!J8","v":"00:00:00"},{"$f":"'TEMPS-ponton'!J8","v":"10:45:27"},{"$f":"'TEMPS-ponton'!K8","v":"11:10:08"}]
[{"$f":"'TEMPS-ponton'!A9","v":5},{"$f":"'TEMPS-ponton'!B9","v":"PORT-MARLY RC 1"},{"$f":"'TEMPS-ponton'!C9","v":"RCPM"},{"$f":"'TEMPS-ponton'!D9","v":"Claudie BODIN-Fanny LAMOUR-Etienne DUPUIS-Jeancharles FAUCHEUX-Gildas KETTANJIAN"},{"$f":"VLOOKUP(A9,Equipes!A:J,2,FALSE)","v":"M"},{"$f":"ROUND(VLOOKUP(A9,Equipes!$A$2:$J$41,10,0),0)","v":50},{"$f":"'TEMPS-ponton'!G9","v":"09:24:40"},{"$f":"'TEMPS-poissy'!G9","v":"00:00:00"},{"$f":"'TEMPS-ponton'!H9","v":"09:55:08"},{"$f":"'TEMPS-ponton'!I9","v":"10:19:14"},{"$f":"'TEMPS-poissy'!J9","v":"00:00:00"},{"$f":"'TEMPS-ponton'!J9","v":"10:49:38"},{"$f":"'TEMPS-ponton'!K9","v":"11:13:52"}]
[{"$f":"'TEMPS-ponton'!A10","v":6},{"$f":"'TEMPS-ponton'!B10","v":"BOULOGNE 92 2"},{"$f":"'TEMPS-ponton'!C10","v":"ACBB"},{"$f":"'TEMPS-ponton'!D10","v":"CéLia ROUSSELLE-Marie Pierre MARSALLON GAMBY-Françis ROBIN-Nicolas LECOEUR-Theodora XENOGIANI"},{"$f":"VLOOKUP(A10,Equipes!A:J,2,FALSE)","v":"M"},{"$f":"ROUND(VLOOKUP(A10,Equipes!$A$2:$J$41,10,0),0)","v":46},{"$f":"'TEMPS-ponton'!G10","v":"09:26:31"},{"$f":"'TEMPS-poissy'!G10","v":"00:00:00"},{"$f":"'TEMPS-ponton'!H10","v":"09:55:00"},{"$f":"'TEMPS-ponton'!I10","v":"10:17:12"},{"$f":"'TEMPS-poissy'!J10","v":"00:00:00"},{"$f":"'TEMPS-ponton'!J10","v":"10:44:58"},{"$f":"'TEMPS-ponton'!K10","v":"11:06:14"}]
[{"$f":"'TEMPS-ponton'!A11","v":7},{"$f":"'TEMPS-ponton'!B11","v":"VILLENNES - POISSY AC 3"},{"$f":"'TEMPS-ponton'!C11","v":"ACVP"},{"$f":"'TEMPS-ponton'!D11","v":"Virginie ALEXANDRE-Jihad LEMARQRI-Cyrille BRUZON-BASCOU-Sebastien CARPENTIER-Marie Estelle D'ARBAUMONT"},{"$f":"VLOOKUP(A11,Equipes!A:J,2,FALSE)","v":"M"},{"$f":"ROUND(VLOOKUP(A11,Equipes!$A$2:$J$41,10,0),0)","v":49},{"$f":"'TEMPS-ponton'!G11","v":"09:28:10"},{"$f":"'TEMPS-poissy'!G11","v":"00:00:00"},{"$f":"'TEMPS-ponton'!H11","v":"09:56:55"},{"$f":"'TEMPS-ponton'!I11","v":"10:19:37"},{"$f":"'TEMPS-poissy'!J11","v":"00:00:00"},{"$f":"'TEMPS-ponton'!J11","v":"10:47:30"},{"$f":"'TEMPS-ponton'!K11","v":"11:09:39"}]
[{"$f":"'TEMPS-ponton'!A12","v":8},{"$f":"'TEMPS-ponton'!B12","v":"JOINVILLE AMJ 1"},{"$f":"'TEMPS-ponton'!C12","v":"Joinville"},{"$f":"'TEMPS-ponton'!D12","v":"Laurent BAUDOIN-Raphaelle BOUVIER FLORY-Sophie BUSTOS-Kastriot JAKA-Thomas AUGER"},{"$f":"VLOOKUP(A12,Equipes!A:J,2,FALSE)","v":"M"},{"$f":"ROUND(VLOOKUP(A12,Equipes!$A$2:$J$41,10,0),0)","v":46},{"$f":"'TEMPS-ponton'!G12","v":"09:30:20"},{"$f":"'TEMPS-poissy'!G12","v":"00:00:00"},{"$f":"'TEMPS-ponton'!H12","v":"09:57:55"},{"$f":"'TEMPS-ponton'!I12","v":"10:18:25"},{"$f":"'TEMPS-poissy'!J12","v":"00:00:00"},{"$f":"'TEMPS-ponton'!J12","v":"10:44:03"},{"$f":"'TEMPS-ponton'!K12","v":"11:03:52"}]
[{"$f":"'TEMPS-ponton'!A13","v":9},{"$f":"'TEMPS-ponton'!B13","v":"NOGENT SUR MARNE CN 1"},{"$f":"'TEMPS-ponton'!C13","v":"CN 1"},{"$f":"'TEMPS-ponton'!D13","v":"Chrystelle SUPIOT-Caroline PIEDNOIRE-Olivier MUCIGNAT-Andre SIMONNET-Fabienne LORTIE"},{"$f":"VLOOKUP(A13,Equipes!A:J,2,FALSE)","v":"M"},{"$f":"ROUND(VLOOKUP(A13,Equipes!$A$2:$J$41,10,0),0)","v":53},{"$f":"'TEMPS-ponton'!G13","v":"09:32:19"},{"$f":"'TEMPS-poissy'!G13","v":"00:00:00"},{"$f":"'TEMPS-ponton'!H13","v":"10:01:07"},{"$f":"'TEMPS-ponton'!I13","v":"10:22:41"},{"$f":"'TEMPS-poissy'!J13","v":"00:00:00"},{"$f":"'TEMPS-ponton'!J13","v":"10:51:58"},{"$f":"'TEMPS-ponton'!K13","v":"11:15:55"}]
[{"$f":"'TEMPS-ponton'!A14","v":10},{"$f":"'TEMPS-ponton'!B14","v":"NOGENT SUR MARNE CN 2"},{"$f":"'TEMPS-ponton'!C14","v":"CN2"},{"$f":"'TEMPS-ponton'!D14","v":"Christophe RUCKEBUSCH-Nicolas BURCKHART-Alice GHEERBRANT-Aurelie DONVAL-Gerard LECA"},{"$f":"VLOOKUP(A14,Equipes!A:J,2,FALSE)","v":"M"},{"$f":"ROUND(VLOOKUP(A14,Equipes!$A$2:$J$41,10,0),0)","v":53},{"$f":"'TEMPS-ponton'!G14","v":"09:34:19"},{"$f":"'TEMPS-poissy'!G14","v":"00:00:00"},{"$f":"'TEMPS-ponton'!H14","v":"10:01:33"},{"$f":"'TEMPS-ponton'!I14","v":"10:22:04"},{"$f":"'TEMPS-poissy'!J14","v":"00:00:00"},{"$f":"'TEMPS-ponton'!J14","v":"10:49:45"},{"$f":"'TEMPS-ponton'!K14","v":"11:11:13"}]
[{"$f":"'TEMPS-ponton'!A15","v":11},{"$f":"'TEMPS-ponton'!B15","v":"BOULOGNE 92 1"},{"$f":"'TEMPS-ponton'!C15","v":"ACBB"},{"$f":"'TEMPS-ponton'!D15","v":"Viviane BALLOY-Timothé BAZIRIES-Alexandre LE FUR-Sigrid PABST-Michel VEDRINE"},{"$f":"VLOOKUP(A15,Equipes!A:J,2,FALSE)","v":"H"},{"$f":"ROUND(VLOOKUP(A15,Equipes!$A$2:$J$41,10,0),0)","v":51},{"$f":"'TEMPS-ponton'!G15","v":"09:36:20"},{"$f":"'TEMPS-poissy'!G15","v":"00:00:00"},{"$f":"'TEMPS-ponton'!H15","v":"10:06:27"},{"$f":"'TEMPS-ponton'!I15","v":"10:31:00"},{"$f":"'TEMPS-poissy'!J15","v":"00:00:00"},{"$f":"'TEMPS-ponton'!J15","v":"10:02:15"},{"$f":"'TEMPS-ponton'!K15","v":"11:27:15"}]
[{"$f":"'TEMPS-ponton'!A16","v":12},{"$f":"'TEMPS-ponton'!B16","v":"EVRY SCA 2"},{"$f":"'TEMPS-ponton'!C16","v":"SCA2"},{"$f":"'TEMPS-ponton'!D16","v":"Laurent YEBOAH-Isabelle MOISSET FLEURISSON-Frederic DUCAUQUY-Sandrine GARCIA-Christelle MARTIN"},{"$f":"VLOOKUP(A16,Equipes!A:J,2,FALSE)","v":"M"},{"$f":"ROUND(VLOOKUP(A16,Equipes!$A$2:$J$41,10,0),0)","v":48},{"$f":"'TEMPS-ponton'!G16","v":"09:38:19"},{"$f":"'TEMPS-poissy'!G16","v":"00:00:00"},{"$f":"'TEMPS-ponton'!H16","v":"10:04:33"},{"$f":"'TEMPS-ponton'!I16","v":"10:24:42"},{"$f":"'TEMPS-poissy'!J16","v":"00:00:00"},{"$f":"'TEMPS-ponton'!J16","v":"10:50:34"},{"$f":"'TEMPS-ponton'!K16","v":"11:10:12"}]
[{"$f":"'TEMPS-ponton'!A17","v":13},{"$f":"'TEMPS-ponton'!B17","v":"PORT-MARLY RC 2"},{"$f":"'TEMPS-ponton'!C17","v":"RCPM2"},{"$f":"'TEMPS-ponton'!D17","v":"Elsa CROZATIER-Cyrielle BERTHIER-Hervé Valette-Eric MOINARD-Anais FEUGA"},{"$f":"VLOOKUP(A17,Equipes!A:J,2,FALSE)","v":"M"},{"$f":"ROUND(VLOOKUP(A17,Equipes!$A$2:$J$41,10,0),0)","v":47},{"$f":"'TEMPS-ponton'!G17","v":"09:40:21"},{"$f":"'TEMPS-poissy'!G17","v":"00:00:00"},{"$f":"'TEMPS-ponton'!H17","v":"10:05:55"},{"$f":"'TEMPS-ponton'!I17","v":"10:26:06"},{"$f":"'TEMPS-poissy'!J17","v":"00:00:00"},{"$f":"'TEMPS-ponton'!J17","v":"10:51:36"},{"$f":"'TEMPS-ponton'!K17","v":"11:12:20"}]
[{"$f":"'TEMPS-ponton'!A18","v":14},{"$f":"'TEMPS-ponton'!B18","v":"MAISONS MESNIL CERAMM 1"},{"$f":"'TEMPS-ponton'!C18","v":"CERAMM1"},{"$f":"'TEMPS-ponton'!D18","v":"Nicolas SCHMITT-Gloria VENDRELL-Christine MARIE LAVAUD-Amaury DE LA LAURENCIE-Amina ELABBADI"},{"$f":"VLOOKUP(A18,Equipes!A:J,2,FALSE)","v":"M"},{"$f":"ROUND(VLOOKUP(A18,Equipes!$A$2:$J$41,10,0),0)","v":50},{"$f":"'TEMPS-ponton'!G18","v":"09:42:29"},{"$f":"'TEMPS-poissy'!G18","v":"00:00:00"},{"$f":"'TEMPS-ponton'!H18","v":"10:10:57"},{"$f":"'TEMPS-ponton'!I18","v":"10:32:21"},{"$f":"'TEMPS-poissy'!J18","v":"00:00:00"},{"$f":"'TEMPS-ponton'!J18","v":"11:01:44"},{"$f":"'TEMPS-ponton'!K18","v":"11:24:44"}]
[{"$f":"'TEMPS-ponton'!A19","v":15},{"$f":"'TEMPS-ponton'!B19","v":"SOISY SUR SEINE CN 1"},{"$f":"'TEMPS-ponton'!C19","v":"CN1"},{"$f":"'TEMPS-ponton'!D19","v":"Bertrand PIOGER-Bruno PERIQUOI-Servane BERTRAND-Alain BERNARD-Robert TRAUET"},{"$f":"VLOOKUP(A19,Equipes!A:J,2,FALSE)","v":"H"},{"$f":"ROUND(VLOOKUP(A19,Equipes!$A$2:$J$41,10,0),0)","v":54},{"$f":"'TEMPS-ponton'!G19","v":"09:44:28"},{"$f":"'TEMPS-poissy'!G19","v":"00:00:00"},{"$f":"'TEMPS-ponton'!H19","v":"10:11:53"},{"$f":"'TEMPS-ponton'!I19","v":"10:31:35"},{"$f":"'TEMPS-poissy'!J19","v":"00:00:00"},{"$f":"'TEMPS-ponton'!J19","v":"10:57:19"},{"$f":"'TEMPS-ponton'!K19","v":"11:18:36"}]
[{"$f":"'TEMPS-ponton'!A20","v":16},{"$f":"'TEMPS-ponton'!B20","v":"PORT-MARLY RC 1"},{"$f":"'TEMPS-ponton'!C20","v":"RCPM1"},{"$f":"'TEMPS-ponton'!D20","v":"Jean-Claude LAFOREST-David CHARTIER-Christophe MARCAIS-Vincent BONTOUX-Alain ROUSSEAU"},{"$f":"VLOOKUP(A20,Equipes!A:J,2,FALSE)","v":"H"},{"$f":"ROUND(VLOOKUP(A20,Equipes!$A$2:$J$41,10,0),0)","v":55},{"$f":"'TEMPS-ponton'!G20","v":"09:46:29"},{"$f":"'TEMPS-poissy'!G20","v":"00:00:00"},{"$f":"'TEMPS-ponton'!H20","v":"10:11:35"},{"$f":"'TEMPS-ponton'!I20","v":"10:30:25"},{"$f":"'TEMPS-poissy'!J20","v":"00:00:00"},{"$f":"'TEMPS-ponton'!J20","v":"10:53:33"},{"$f":"'TEMPS-ponton'!K20","v":"11:11:54"}]
[{"$f":"'TEMPS-ponton'!A21","v":17},{"$f":"'TEMPS-ponton'!B21","v":"ANDRESY CA CONFLUENT 1"},{"$f":"'TEMPS-ponton'!C21","v":"CAC1"},{"$f":"'TEMPS-ponton'!D21","v":"Daphne PARIZOT-Agnes BURGHGRAEVE SELLEN-Sylvie FRANSSEN-Severine LEGAILLARD-Martine LE ROUX"},{"$f":"VLOOKUP(A21,Equipes!A:J,2,FALSE)","v":"F"},{"$f":"ROUND(VLOOKUP(A21,Equipes!$A$2:$J$41,10,0),0)","v":55},{"$f":"'TEMPS-ponton'!G21","v":"09:48:01"},{"$f":"'TEMPS-poissy'!G21","v":"00:00:00"},{"$f":"'TEMPS-ponton'!H21","v":"10:21:59"},{"$f":"'TEMPS-ponton'!I21","v":"10:47:41"},{"$f":"'TEMPS-poissy'!J21","v":"00:00:00"},{"$f":"'TEMPS-ponton'!J21","v":"11:22:02"},{"$f":"'TEMPS-ponton'!K21","v":"11:49:11"}]
[{"$f":"'TEMPS-ponton'!A22","v":18},{"$f":"'TEMPS-ponton'!B22","v":"MAISONS MESNIL CERAMM 2"},{"$f":"'TEMPS-ponton'!C22","v":"CERAMM2"},{"$f":"'TEMPS-ponton'!D22","v":"Claude LEMENAGER-Didier GIRARDEAU-Laurent LIBOTTE-Alain GIRARD-Cecile JEAMMES"},{"$f":"VLOOKUP(A22,Equipes!A:J,2,FALSE)","v":"H"},{"$f":"ROUND(VLOOKUP(A22,Equipes!$A$2:$J$41,10,0),0)","v":58},{"$f":"'TEMPS-ponton'!G22","v":"09:50:59"},{"$f":"'TEMPS-poissy'!G22","v":"00:00:00"},{"$f":"'TEMPS-ponton'!H22","v":"10:19:49"},{"$f":"'TEMPS-ponton'!I22","v":"10:42:08"},{"$f":"'TEMPS-poissy'!J22","v":"00:00:00"},{"$f":"'TEMPS-ponton'!J22","v":"11:10:30"},{"$f":"'TEMPS-ponton'!K22","v":"11:32:37"}]
[{"$f":"'TEMPS-ponton'!A23","v":19},{"$f":"'TEMPS-ponton'!B23","v":"VILLENNES - POISSY AC 1"},{"$f":"'TEMPS-ponton'!C23","v":"ACVP1"},{"$f":"'TEMPS-ponton'!D23","v":"Olivier POLGE-Odile POLGE-Laurent BONHOMMET-Antoine VOLPI-Philippe STROHM"},{"$f":"VLOOKUP(A23,Equipes!A:J,2,FALSE)","v":"H"},{"$f":"ROUND(VLOOKUP(A23,Equipes!$A$2:$J$41,10,0),0)","v":55},{"$f":"'TEMPS-ponton'!G23","v":"09:53:00"},{"$f":"'TEMPS-poissy'!G23","v":"00:00:00"},{"$f":"'TEMPS-ponton'!H23","v":"10:22:56"},{"$f":"'TEMPS-ponton'!I23","v":"10:45:02"},{"$f":"'TEMPS-poissy'!J23","v":"00:00:00"},{"$f":"'TEMPS-ponton'!J23","v":"11:12:47"},{"$f":"'TEMPS-ponton'!K23","v":"11:33:56"}]
[{"$f":"'TEMPS-ponton'!A24","v":20},{"$f":"'TEMPS-ponton'!B24","v":"ROUEN CNAR 1"},{"$f":"'TEMPS-ponton'!C24","v":"CNAR1"},{"$f":"'TEMPS-ponton'!D24","v":"Nathalie MOUSSET-Francois LAIR-Betty GESLAIN-Thierry DUCHESNE-Stephane MOUSSET"},{"$f":"VLOOKUP(A24,Equipes!A:J,2,FALSE)","v":"M"},{"$f":"ROUND(VLOOKUP(A24,Equipes!$A$2:$J$41,10,0),0)","v":55},{"$f":"'TEMPS-ponton'!G24","v":"09:55:00"},{"$f":"'TEMPS-poissy'!G24","v":"00:00:00"},{"$f":"'TEMPS-ponton'!H24","v":"10:23:53"},{"$f":"'TEMPS-ponton'!I24","v":"10:45:41"},{"$f":"'TEMPS-poissy'!J24","v":"00:00:00"},{"$f":"'TEMPS-ponton'!J24","v":"11:12:10"},{"$f":"'TEMPS-ponton'!K24","v":"11:32:13"}]
[{"$f":"'TEMPS-ponton'!A25","v":21},{"$f":"'TEMPS-ponton'!B25","v":"PORT-MARLY RC 2"},{"$f":"'TEMPS-ponton'!C25","v":"RCPM2"},{"$f":"'TEMPS-ponton'!D25","v":"Guillaume CHARRON-Philippe VERHE-Stephan REYNIER-Dominique LEROUX-Luciano AUTUNNALE"},{"$f":"VLOOKUP(A25,Equipes!A:J,2,FALSE)","v":"H"},{"$f":"ROUND(VLOOKUP(A25,Equipes!$A$2:$J$41,10,0),0)","v":51},{"$f":"'TEMPS-ponton'!G25","v":"09:57:00"},{"$f":"'TEMPS-poissy'!G25","v":"00:00:00"},{"$f":"'TEMPS-ponton'!H25","v":"10:22:28"},{"$f":"'TEMPS-ponton'!I25","v":"10:43:04"},{"$f":"'TEMPS-poissy'!J25","v":"00:00:00"},{"$f":"'TEMPS-ponton'!J25","v":"11:08:43"},{"$f":"'TEMPS-ponton'!K25","v":"11:28:40"}]
[{"$f":"'TEMPS-ponton'!A26","v":22},{"$f":"'TEMPS-ponton'!B26","v":"COUDRAY MONTCEAUX A 1"},{"$f":"'TEMPS-ponton'!C26","v":"coudray1"},{"$f":"'TEMPS-ponton'!D26","v":"Joseph RAYNAUD-Frederic MORAT-Benjamin HOUILLON-Pascal BEAUSSART-Anne HOUAL"},{"$f":"VLOOKUP(A26,Equipes!A:J,2,FALSE)","v":"H"},{"$f":"ROUND(VLOOKUP(A26,Equipes!$A$2:$J$41,10,0),0)","v":52},{"$f":"'TEMPS-ponton'!G26","v":"09:59:00"},{"$f":"'TEMPS-poissy'!G26","v":"00:00:00"},{"$f":"'TEMPS-ponton'!H26","v":"10:28:10"},{"$f":"'TEMPS-ponton'!I26","v":"10:50:40"},{"$f":"'TEMPS-poissy'!J26","v":"00:00:00"},{"$f":"'TEMPS-ponton'!J26","v":"11:18:43"},{"$f":"'TEMPS-ponton'!K26","v":"11:40:46"}]
[{"$f":"'TEMPS-ponton'!A27","v":23},{"$f":"'TEMPS-ponton'!B27","v":"SN OISE 1"},{"$f":"'TEMPS-ponton'!C27","v":"SN Oise 1\n"},{"$f":"'TEMPS-ponton'!D27","v":"Agnes AUDEBERT-Nicolas RAUCH-Jerome ROUGE-Nathalie BAUDIER-Isabelle JOUBERT"},{"$f":"VLOOKUP(A27,Equipes!A:J,2,FALSE)","v":"M"},{"$f":"ROUND(VLOOKUP(A27,Equipes!$A$2:$J$41,10,0),0)","v":50},{"$f":"'TEMPS-ponton'!G27","v":"10:00:00"},{"$f":"'TEMPS-poissy'!G27","v":"00:00:00"},{"$f":"'TEMPS-ponton'!H27","v":"10:31:24"},{"$f":"'TEMPS-ponton'!I27","v":"10:56:32"},{"$f":"'TEMPS-poissy'!J27","v":"00:00:00"},{"$f":"'TEMPS-ponton'!J27","v":"11:28:06"},{"$f":"'TEMPS-ponton'!K27","v":"11:53:02"}]
[{"$f":"'TEMPS-ponton'!A28","v":24},{"$f":"'TEMPS-ponton'!B28","v":"MEULAN LES MUREAUX AMMH 1"},{"$f":"'TEMPS-ponton'!C28","v":"AMMH1"},{"$f":"'TEMPS-ponton'!D28","v":"Xavier MARSAIS-Eric PRENEY-Yannick DAGMEY-David COINE-Arthur VAN SLOOTEN"},{"$f":"VLOOKUP(A28,Equipes!A:J,2,FALSE)","v":"H"},{"$f":"ROUND(VLOOKUP(A28,Equipes!$A$2:$J$41,10,0),0)","v":53},{"$f":"'TEMPS-ponton'!G28","v":"10:02:59"},{"$f":"'TEMPS-poissy'!G28","v":"00:00:00"},{"$f":"'TEMPS-ponton'!H28","v":"10:29:42"},{"$f":"'TEMPS-ponton'!I28","v":"10:50:58"},{"$f":"'TEMPS-poissy'!J28","v":"00:00:00"},{"$f":"'TEMPS-ponton'!J28","v":"11:18:58"},{"$f":"'TEMPS-ponton'!K28","v":"11:39:03"}]
[{"$f":"'TEMPS-ponton'!A29","v":25},{"$f":"'TEMPS-ponton'!B29","v":"VILLENNES - POISSY AC 2"},{"$f":"'TEMPS-ponton'!C29","v":"ACVP2"},{"$f":"'TEMPS-ponton'!D29","v":"Franck CARIOU-Michael LE BANNER-Valerie DECAESTECKER-Karine GUILBON-Christophe ELINE"},{"$f":"VLOOKUP(A29,Equipes!A:J,2,FALSE)","v":"M"},{"$f":"ROUND(VLOOKUP(A29,Equipes!$A$2:$J$41,10,0),0)","v":54},{"$f":"'TEMPS-ponton'!G29","v":"10:05:01"},{"$f":"'TEMPS-poissy'!G29","v":"00:00:00"},{"$f":"'TEMPS-ponton'!H29","v":"10:31:39"},{"$f":"'TEMPS-ponton'!I29","v":"10:52:48"},{"$f":"'TEMPS-poissy'!J29","v":"00:00:00"},{"$f":"'TEMPS-ponton'!J29","v":"11:21:14"},{"$f":"'TEMPS-ponton'!K29","v":"11:43:28"}]
[{"$f":"'TEMPS-ponton'!A30","v":26},{"$f":"'TEMPS-ponton'!B30","v":"EVRY SCA 1"},{"$f":"'TEMPS-ponton'!C30","v":"SCA 1"},{"$f":"'TEMPS-ponton'!D30","v":"Anne CARDUNER-Olivia PEZZOLI-Bruno CASIMIR-Lionel BOISSONNAT-Kristell MAUCHET"},{"$f":"VLOOKUP(A30,Equipes!A:J,2,FALSE)","v":"M"},{"$f":"ROUND(VLOOKUP(A30,Equipes!$A$2:$J$41,10,0),0)","v":56},{"$f":"'TEMPS-ponton'!G30","v":"10:07:01"},{"$f":"'TEMPS-poissy'!G30","v":"00:00:00"},{"$f":"'TEMPS-ponton'!H30","v":"10:36:39"},{"$f":"'TEMPS-ponton'!I30","v":"10:59:33"},{"$f":"'TEMPS-poissy'!J30","v":"00:00:00"},{"$f":"'TEMPS-ponton'!J30","v":"11:29:29"},{"$f":"'TEMPS-ponton'!K30","v":"11:53:31"}]
[{"$f":"'TEMPS-ponton'!A31","v":27},{"$f":"'TEMPS-ponton'!B31","v":"MEULAN LES MUREAUX AMMH 1"},{"$f":"'TEMPS-ponton'!C31","v":"AMMH1"},{"$f":"'TEMPS-ponton'!D31","v":"Gwenaelle MARSAIS-Sophie SEFFAR-Catherine MARTINIER-Christelle GOANVIC-Marie LAMORE"},{"$f":"VLOOKUP(A31,Equipes!A:J,2,FALSE)","v":"F"},{"$f":"ROUND(VLOOKUP(A31,Equipes!$A$2:$J$41,10,0),0)","v":47},{"$f":"'TEMPS-ponton'!G31","v":"10:09:01"},{"$f":"'TEMPS-poissy'!G31","v":"00:00:00"},{"$f":"'TEMPS-ponton'!H31","v":"10:42:15"},{"$f":"'TEMPS-ponton'!I31","v":"11:09:37"},{"$f":"'TEMPS-poissy'!J31","v":"00:00:00"},{"$f":"'TEMPS-ponton'!J31","v":"11:42:48"},{"$f":"'TEMPS-ponton'!K31","v":"12:08:48"}]
[{"$f":"'TEMPS-ponton'!A32","v":28},{"$f":"'TEMPS-ponton'!B32","v":"VILLENNES - POISSY AC 1"},{"$f":"'TEMPS-ponton'!C32","v":"ACVP1"},{"$f":"'TEMPS-ponton'!D32","v":"Frederic LE ROUX-Corinne HUARD-ROLLAND-Elodie DEREMIENCE-Marie-Claude LAUNAY-Olivier COSNEAU"},{"$f":"VLOOKUP(A32,Equipes!A:J,2,FALSE)","v":"M"},{"$f":"ROUND(VLOOKUP(A32,Equipes!$A$2:$J$41,10,0),0)","v":53},{"$f":"'TEMPS-ponton'!G32","v":"10:11:10"},{"$f":"'TEMPS-poissy'!G32","v":"00:00:00"},{"$f":"'TEMPS-ponton'!H32","v":"10:37:24"},{"$f":"'TEMPS-ponton'!I32","v":"10:57:26"},{"$f":"'TEMPS-poissy'!J32","v":"00:00:00"},{"$f":"'TEMPS-ponton'!J32","v":"11:23:13"},{"$f":"'TEMPS-ponton'!K32","v":"11:42:17"}]
[{"$f":"'TEMPS-ponton'!A33","v":29},{"$f":"'TEMPS-ponton'!B33","v":"FONTAINEBLEAU APF 1"},{"$f":"'TEMPS-ponton'!C33","v":"APF1"},{"$f":"'TEMPS-ponton'!D33","v":"Kathleen SANCHEZ-Laurent FOUQUE-Christian MESSALES-Denis FLORY-David WEBER"},{"$f":"VLOOKUP(A33,Equipes!A:J,2,FALSE)","v":"H"},{"$f":"ROUND(VLOOKUP(A33,Equipes!$A$2:$J$41,10,0),0)","v":57},{"$f":"'TEMPS-ponton'!G33","v":"10:13:00"},{"$f":"'TEMPS-poissy'!G33","v":"00:00:00"},{"$f":"'TEMPS-ponton'!H33","v":"10:43:14"},{"$f":"'TEMPS-ponton'!I33","v":"11:07:12"},{"$f":"'TEMPS-poissy'!J33","v":"00:00:00"},{"$f":"'TEMPS-ponton'!J33","v":"11:36:29"},{"$f":"'TEMPS-ponton'!K33","v":"12:01:05"}]
[{"$f":"'TEMPS-ponton'!A34","v":30},{"$f":"'TEMPS-ponton'!B34","v":"JOINVILLE AMJ 1"},{"$f":"'TEMPS-ponton'!C34","v":"AMJ1"},{"$f":"'TEMPS-ponton'!D34","v":"Vincent FABIEN-Arnaud PUPPO-Jonathan ROOKE-Xavier SUCHET-Nicolas JAMAULT"},{"$f":"VLOOKUP(A34,Equipes!A:J,2,FALSE)","v":"H"},{"$f":"ROUND(VLOOKUP(A34,Equipes!$A$2:$J$41,10,0),0)","v":51},{"$f":"'TEMPS-ponton'!G34","v":"10:15:00"},{"$f":"'TEMPS-poissy'!G34","v":"00:00:00"},{"$f":"'TEMPS-ponton'!H34","v":"10:42:26"},{"$f":"'TEMPS-ponton'!I34","v":"11:03:39"},{"$f":"'TEMPS-poissy'!J34","v":"00:00:00"},{"$f":"'TEMPS-ponton'!J34","v":"11:30:15"},{"$f":"'TEMPS-ponton'!K34","v":"11:51:06"}]
[{"$f":"'TEMPS-ponton'!A35","v":31},{"$f":"'TEMPS-ponton'!B35","v":"NOGENT SUR MARNE CN 3"},{"$f":"'TEMPS-ponton'!C35","v":"CN3"},{"$f":"'TEMPS-ponton'!D35","v":"Alexandra COHEN SALMON-Isabelle MILON-BANNEROT-Jerome TROMBOFSKY-Olivier PASCAL-Elisabeth LAUNAY"},{"$f":"VLOOKUP(A35,Equipes!A:J,2,FALSE)","v":"M"},{"$f":"ROUND(VLOOKUP(A35,Equipes!$A$2:$J$41,10,0),0)","v":53},{"$f":"'TEMPS-ponton'!G35","v":"10:17:03"},{"$f":"'TEMPS-poissy'!G35","v":"00:00:00"},{"$f":"'TEMPS-ponton'!H35","v":"10:49:06"},{"$f":"'TEMPS-ponton'!I35","v":"11:13:20"},{"$f":"'TEMPS-poissy'!J35","v":"00:00:00"},{"$f":"'TEMPS-ponton'!J35","v":"11:47:13"},{"$f":"'TEMPS-ponton'!K35","v":"12:13:50"}]
[{"$f":"'TEMPS-ponton'!A36","v":32},{"$f":"'TEMPS-ponton'!B36","v":"BOULOGNE 92 1"},{"$f":"'TEMPS-ponton'!C36","v":"ACBB1"},{"$f":"'TEMPS-ponton'!D36","v":"Isabelle MAIRE-Théo BEL BERBEL- LURBE-Thã‰Odore SEDAROS-Omar OUAZZANI-Alexandra MENEZES"},{"$f":"VLOOKUP(A36,Equipes!A:J,2,FALSE)","v":"H"},{"$f":"ROUND(VLOOKUP(A36,Equipes!$A$2:$J$41,10,0),0)","v":43},{"$f":"'TEMPS-ponton'!G36","v":"00:00:00"},{"$f":"'TEMPS-poissy'!G36","v":"00:00:00"},{"$f":"'TEMPS-ponton'!H36","v":"00:00:00"},{"$f":"'TEMPS-ponton'!I36","v":"00:00:00"},{"$f":"'TEMPS-poissy'!J36","v":"00:00:00"},{"$f":"'TEMPS-ponton'!J36","v":"00:00:00"},{"$f":"'TEMPS-ponton'!K36","v":"00:00:00"}]
[{"$f":"'TEMPS-ponton'!A37","v":33},{"$f":"'TEMPS-ponton'!B37","v":"XX"},{"$f":"'TEMPS-ponton'!C37","v":"XX"},{"$f":"'TEMPS-ponton'!D37","v":"XX-XX-XX-XX-XX"},{"$f":"VLOOKUP(A37,Equipes!A:J,2,FALSE)","v":"X"},{"$f":"ROUND(VLOOKUP(A37,Equipes!$A$2:$J$41,10,0),0)","v":0},{"$f":"'TEMPS-ponton'!G37","v":"00:00:00"},{"$f":"'TEMPS-poissy'!G37","v":"00:00:00"},{"$f":"'TEMPS-ponton'!H37","v":"00:00:00"},{"$f":"'TEMPS-ponton'!I37","v":"00:00:00"},{"$f":"'TEMPS-poissy'!J37","v":"00:00:00"},{"$f":"'TEMPS-ponton'!J37","v":"00:00:00"},{"$f":"'TEMPS-ponton'!K37","v":"00:00:00"}]
[{"$f":"'TEMPS-ponton'!A38","v":34},{"$f":"'TEMPS-ponton'!B38","v":"XX"},{"$f":"'TEMPS-ponton'!C38","v":"XX"},{"$f":"'TEMPS-ponton'!D38","v":"XX-XX-XX-XX-XX"},{"$f":"VLOOKUP(A38,Equipes!A:J,2,FALSE)","v":"X"},{"$f":"ROUND(VLOOKUP(A38,Equipes!$A$2:$J$41,10,0),0)","v":0},{"$f":"'TEMPS-ponton'!G38","v":"10:19:09"},{"$f":"'TEMPS-poissy'!G38","v":"00:00:00"},{"$f":"'TEMPS-ponton'!H38","v":"00:00:00"},{"$f":"'TEMPS-ponton'!I38","v":"10:54:26"},{"$f":"'TEMPS-poissy'!J38","v":"00:00:00"},{"$f":"'TEMPS-ponton'!J38","v":"00:00:00"},{"$f":"'TEMPS-ponton'!K38","v":"11:24:06"}]
[{"$f":"'TEMPS-ponton'!A39","v":35},{"$f":"'TEMPS-ponton'!B39","v":"XX"},{"$f":"'TEMPS-ponton'!C39","v":"XX"},{"$f":"'TEMPS-ponton'!D39","v":"XX-XX-XX-XX-XX"},{"$f":"VLOOKUP(A39,Equipes!A:J,2,FALSE)","v":"X"},{"$f":"ROUND(VLOOKUP(A39,Equipes!$A$2:$J$41,10,0),0)","v":0},{"$f":"'TEMPS-ponton'!G39","v":"00:00:00"},{"$f":"'TEMPS-poissy'!G39","v":"00:00:00"},{"$f":"'TEMPS-ponton'!H39","v":"00:00:00"},{"$f":"'TEMPS-ponton'!I39","v":"00:00:00"},{"$f":"'TEMPS-poissy'!J39","v":"00:00:00"},{"$f":"'TEMPS-ponton'!J39","v":"00:00:00"},{"$f":"'TEMPS-ponton'!K39","v":"00:00:00"}]
[{"$f":"'TEMPS-ponton'!A40","v":36},{"$f":"'TEMPS-ponton'!B40","v":"XX"},{"$f":"'TEMPS-ponton'!C40","v":"XX"},{"$f":"'TEMPS-ponton'!D40","v":"XX-XX-XX-XX-XX"},{"$f":"VLOOKUP(A40,Equipes!A:J,2,FALSE)","v":"X"},{"$f":"ROUND(VLOOKUP(A40,Equipes!$A$2:$J$41,10,0),0)","v":0},{"$f":"'TEMPS-ponton'!G40","v":"00:00:00"},{"$f":"'TEMPS-poissy'!G40","v":"00:00:00"},{"$f":"'TEMPS-ponton'!H40","v":"00:00:00"},{"$f":"'TEMPS-ponton'!I40","v":"00:00:00"},{"$f":"'TEMPS-poissy'!J40","v":"00:00:00"},{"$f":"'TEMPS-ponton'!J40","v":"00:00:00"},{"$f":"'TEMPS-ponton'!K40","v":"00:00:00"}]
[{"$f":"'TEMPS-ponton'!A41","v":37},{"$f":"'TEMPS-ponton'!B41","v":"XX"},{"$f":"'TEMPS-ponton'!C41","v":"XX"},{"$f":"'TEMPS-ponton'!D41","v":"XX-XX-XX-XX-XX"},{"$f":"VLOOKUP(A41,Equipes!A:J,2,FALSE)","v":"X"},{"$f":"ROUND(VLOOKUP(A41,Equipes!$A$2:$J$41,10,0),0)","v":0},{"$f":"'TEMPS-ponton'!G41","v":"00:00:00"},{"$f":"'TEMPS-poissy'!G41","v":"00:00:00"},{"$f":"'TEMPS-ponton'!H41","v":"00:00:00"},{"$f":"'TEMPS-ponton'!I41","v":"00:00:00"},{"$f":"'TEMPS-poissy'!J41","v":"00:00:00"},{"$f":"'TEMPS-ponton'!J41","v":"00:00:00"},{"$f":"'TEMPS-ponton'!K41","v":"00:00:00"}]
[{"$f":"'TEMPS-ponton'!A42","v":38},{"$f":"'TEMPS-ponton'!B42","v":"XX"},{"$f":"'TEMPS-ponton'!C42","v":"XX"},{"$f":"'TEMPS-ponton'!D42","v":"XX-XX-XX-XX-XX"},{"$f":"VLOOKUP(A42,Equipes!A:J,2,FALSE)","v":"X"},{"$f":"ROUND(VLOOKUP(A42,Equipes!$A$2:$J$41,10,0),0)","v":0},{"$f":"'TEMPS-ponton'!G42","v":"00:00:00"},{"$f":"'TEMPS-poissy'!G42","v":"00:00:00"},{"$f":"'TEMPS-ponton'!H42","v":"00:00:00"},{"$f":"'TEMPS-ponton'!I42","v":"00:00:00"},{"$f":"'TEMPS-poissy'!J42","v":"00:00:00"},{"$f":"'TEMPS-ponton'!J42","v":"00:00:00"},{"$f":"'TEMPS-ponton'!K42","v":"00:00:00"}]
[{"$f":"'TEMPS-ponton'!A43","v":39},{"$f":"'TEMPS-ponton'!B43","v":"XX"},{"$f":"'TEMPS-ponton'!C43","v":"XX"},{"$f":"'TEMPS-ponton'!D43","v":"XX-XX-XX-XX-XX"},{"$f":"VLOOKUP(A43,Equipes!A:J,2,FALSE)","v":"X"},{"$f":"ROUND(VLOOKUP(A43,Equipes!$A$2:$J$41,10,0),0)","v":0},{"$f":"'TEMPS-ponton'!G43","v":"00:00:00"},{"$f":"'TEMPS-poissy'!G43","v":"00:00:00"},{"$f":"'TEMPS-ponton'!H43","v":"00:00:00"},{"$f":"'TEMPS-ponton'!I43","v":"00:00:00"},{"$f":"'TEMPS-poissy'!J43","v":"00:00:00"},{"$f":"'TEMPS-ponton'!J43","v":"00:00:00"},{"$f":"'TEMPS-ponton'!K43","v":"00:00:00"}]
[{"$f":"'TEMPS-ponton'!A44","v":40},{"$f":"'TEMPS-ponton'!B44","v":"XX"},{"$f":"'TEMPS-ponton'!C44","v":"XX"},{"$f":"'TEMPS-ponton'!D44","v":"XX-XX-XX-XX-XX"},{"$f":"VLOOKUP(A44,Equipes!A:J,2,FALSE)","v":"X"},{"$f":"ROUND(VLOOKUP(A44,Equipes!$A$2:$J$41,10,0),0)","v":0},{"$f":"'TEMPS-ponton'!G44","v":"00:00:00"},{"$f":"'TEMPS-poissy'!G44","v":"00:00:00"},{"$f":"'TEMPS-ponton'!H44","v":"00:00:00"},{"$f":"'TEMPS-ponton'!I44","v":"00:00:00"},{"$f":"'TEMPS-poissy'!J44","v":"00:00:00"},{"$f":"'TEMPS-ponton'!J44","v":"00:00:00"},{"$f":"'TEMPS-ponton'!K44","v":"00:00:00"}]

{"sheet":"Temps Pass","index":16,"n_rows":44,"n_cols":12,"rows_kept":44,"cut":false,"hidden":false,"merged":[[0,0,1,2],[0,3,1,3],[0,6,1,11]]}
["GRAND 8     ",null,null,{"$f":"'Note explicative fichier'!E3","v":"2024-06-02"},null,null,"Tableau des Temps de passages"]
[]
["Yolette N°","Club","Ville","Equipage ","Cat.","Age Moy.","Poissy-1","1 / 4\nG-8","1 / 2\nG-8","Poissy-2","3 / 4\nG-8","Arrivée"]
[{"$f":"'TEMPS-ponton'!A4","v":"Record"},{"$f":"'TEMPS-ponton'!B4","v":"POLYTECHNIQUE ( Référence 2012 )"},{"$f":"'TEMPS-ponton'!C4","v":"Palaiseau"},{"$f":"'TEMPS-ponton'!D4","v":"FERRERO Michel - Alexandre Rosinski - BOYAUD Mathieu - GODDE Olivier - THECKES Benoit"},null,null,{"$f":"'Heures Pass'!H4-'Heures Pass'!$G4","v":-0.36562499999999998},{"$f":"'Heures Pass'!I4-'Heures Pass'!$G4","v":"00:23:35"},{"$f":"'Heures Pass'!J4-'Heures Pass'!$G4","v":"00:40:41"},{"$f":"'Heures Pass'!K4-'Heures Pass'!$G4","v":-0.36562499999999998},{"$f":"'Heures Pass'!L4-'Heures Pass'!$G4","v":"01:04:34"},{"$f":"'Heures Pass'!M4-'Heures Pass'!$G4","v":"01:21:48"}]
[{"$f":"'TEMPS-ponton'!A5","v":1},{"$f":"'TEMPS-ponton'!B5","v":"ANDRESY CA CONFLUENT 1"},{"$f":"'TEMPS-ponton'!C5","v":"Cac1"},{"$f":"'TEMPS-ponton'!D5","v":"Stephanie LAPORTE-Marine NACERI-Marc LACCASSAGNE-Stephane ZETTWOOG-Fouzia VOIRIN"},{"$f":"VLOOKUP(A5,Equipes!A:J,2,FALSE)","v":"M"},{"$f":"ROUND(VLOOKUP(A5,Equipes!$A$2:$J$41,10,0),0)","v":49},{"$f":"'Heures Pass'!H5-'Heures Pass'!$G5","v":-0.38591435185185186},{"$f":"'Heures Pass'!I5-'Heures Pass'!$G5","v":"00:33:20"},{"$f":"'Heures Pass'!J5-'Heures Pass'!$G5","v":"00:57:57"},{"$f":"'Heures Pass'!K5-'Heures Pass'!$G5","v":-0.38591435185185186},{"$f":"'Heures Pass'!L5-'Heures Pass'!$G5","v":"01:27:46"},{"$f":"'Heures Pass'!M5-'Heures Pass'!$G5","v":"01:51:53"}]
[{"$f":"'TEMPS-ponton'!A6","v":2},{"$f":"'TEMPS-ponton'!B6","v":"CAUDEBEC EN CAUX ACVS 1"},{"$f":"'TEMPS-ponton'!C6","v":"Caudebec"},{"$f":"'TEMPS-ponton'!D6","v":"Martine NARBAIS-JAUREGUY-Caroline KERVRANN-Stephane DELAMARE-Nicolas BARRAY-Francois NARBAIS-JAUREGUY"},{"$f":"VLOOKUP(A6,Equipes!A:J,2,FALSE)","v":"M"},{"$f":"ROUND(VLOOKUP(A6,Equipes!$A$2:$J$41,10,0),0)","v":55},{"$f":"'Heures Pass'!H6-'Heures Pass'!$G6","v":-0.38796296296296295},{"$f":"'Heures Pass'!I6-'Heures Pass'!$G6","v":"00:30:08"},{"$f":"'Heures Pass'!J6-'Heures Pass'!$G6","v":"00:52:22"},{"$f":"'Heures Pass'!K6-'Heures Pass'!$G6","v":-0.38796296296296295},{"$f":"'Heures Pass'!L6-'Heures Pass'!$G6","v":"01:21:30"},{"$f":"'Heures Pass'!M6-'Heures Pass'!$G6","v":"01:43:47"}]
[{"$f":"'TEMPS-ponton'!A7","v":3},{"$f":"'TEMPS-ponton'!B7","v":"ANDRESY CA CONFLUENT 2"},{"$f":"'TEMPS-ponton'!C7","v":"CAC 2"},{"$f":"'TEMPS-ponton'!D7","v":"Anna ALCALOIDEPOIXBLANC-Geoffrey GHIZZONI-Nathalie BOURGEOIS-Franck CHRISTIANNOT-NicOLAS delaunoy"},{"$f":"VLOOKUP(A7,Equipes!A:J,2,FALSE)","v":"M"},{"$f":"ROUND(VLOOKUP(A7,Equipes!$A$2:$J$41,10,0),0)","v":55},{"$f":"'Heures Pass'!H7-'Heures Pass'!$G7","v":-0.38935185185185184},{"$f":"'Heures Pass'!I7-'Heures Pass'!$G7","v":"00:33:48"},{"$f":"'Heures Pass'!J7-'Heures Pass'!$G7","v":"01:00:49"},{"$f":"'Heures Pass'!K7-'Heures Pass'!$G7","v":-0.38935185185185184},{"$f":"'Heures Pass'!L7-'Heures Pass'!$G7","v":"01:32:13"},{"$f":"'Heures Pass'!M7-'Heures Pass'!$G7","v":"01:57:49"}]
[{"$f":"'TEMPS-ponton'!A8","v":4},{"$f":"'TEMPS-ponton'!B8","v":"ANDRESY CA CONFLUENT 1"},{"$f":"'TEMPS-ponton'!C8","v":"CAC3"},{"$f":"'TEMPS-ponton'!D8","v":"Emmanuel SALIN-Ousseni PARKOUDA-Jean-Baptiste PROVENZANO-Jerome CLAVE-Julian GALLELA"},{"$f":"VLOOKUP(A8,Equipes!A:J,2,FALSE)","v":"H"},{"$f":"ROUND(VLOOKUP(A8,Equipes!$A$2:$J$41,10,0),0)","v":46},{"$f":"'Heures Pass'!H8-'Heures Pass'!$G8","v":-0.39075231481481482},{"$f":"'Heures Pass'!I8-'Heures Pass'!$G8","v":"00:29:45"},{"$f":"'Heures Pass'!J8-'Heures Pass'!$G8","v":"00:53:48"},{"$f":"'Heures Pass'!K8-'Heures Pass'!$G8","v":-0.39075231481481482},{"$f":"'Heures Pass'!L8-'Heures Pass'!$G8","v":"01:22:46"},{"$f":"'Heures Pass'!M8-'Heures Pass'!$G8","v":"01:47:27"}]
[{"$f":"'TEMPS-ponton'!A9","v":5},{"$f":"'TEMPS-ponton'!B9","v":"PORT-MARLY RC 1"},{"$f":"'TEMPS-ponton'!C9","v":"RCPM"},{"$f":"'TEMPS-ponton'!D9","v":"Claudie BODIN-Fanny LAMOUR-Etienne DUPUIS-Jeancharles FAUCHEUX-Gildas KETTANJIAN"},{"$f":"VLOOKUP(A9,Equipes!A:J,2,FALSE)","v":"M"},{"$f":"ROUND(VLOOKUP(A9,Equipes!$A$2:$J$41,10,0),0)","v":50},{"$f":"'Heures Pass'!H9-'Heures Pass'!$G9","v":-0.39212962962962961},{"$f":"'Heures Pass'!I9-'Heures Pass'!$G9","v":"00:30:28"},{"$f":"'Heures Pass'!J9-'Heures Pass'!$G9","v":"00:54:34"},{"$f":"'Heures Pass'!K9-'Heures Pass'!$G9","v":-0.39212962962962961},{"$f":"'Heures Pass'!L9-'Heures Pass'!$G9","v":"01:24:58"},{"$f":"'Heures Pass'!M9-'Heures Pass'!$G9","v":"01:49:12"}]
[{"$f":"'TEMPS-ponton'!A10","v":6},{"$f":"'TEMPS-ponton'!B10","v":"BOULOGNE 92 2"},{"$f":"'TEMPS-ponton'!C10","v":"ACBB"},{"$f":"'TEMPS-ponton'!D10","v":"CéLia ROUSSELLE-Marie Pierre MARSALLON GAMBY-Françis ROBIN-Nicolas LECOEUR-Theodora XENOGIANI"},{"$f":"VLOOKUP(A10,Equipes!A:J,2,FALSE)","v":"M"},{"$f":"ROUND(VLOOKUP(A10,Equipes!$A$2:$J$41,10,0),0)","v":46},{"$f":"'Heures Pass'!H10-'Heures Pass'!$G10","v":-0.39341435185185186},{"$f":"'Heures Pass'!I10-'Heures Pass'!$G10","v":"00:28:29"},{"$f":"'Heures Pass'!J10-'Heures Pass'!$G10","v":"00:50:41"},{"$f":"'Heures Pass'!K10-'Heures Pass'!$G10","v":-0.39341435185185186},{"$f":"'Heures Pass'!L10-'Heures Pass'!$G10","v":"01:18:27"},{"$f":"'Heures Pass'!M10-'Heures Pass'!$G10","v":"01:39:43"}]
[{"$f":"'TEMPS-ponton'!A11","v":7},{"$f":"'TEMPS-ponton'!B11","v":"VILLENNES - POISSY AC 3"},{"$f":"'TEMPS-ponton'!C11","v":"ACVP"},{"$f":"'TEMPS-ponton'!D11","v":"Virginie ALEXANDRE-Jihad LEMARQRI-Cyrille BRUZON-BASCOU-Sebastien CARPENTIER-Marie Estelle D'ARBAUMONT"},{"$f":"VLOOKUP(A11,Equipes!A:J,2,FALSE)","v":"M"},{"$f":"ROUND(VLOOKUP(A11,Equipes!$A$2:$J$41,10,0),0)","v":49},{"$f":"'Heures Pass'!H11-'Heures Pass'!$G11","v":-0.39456018518518521},{"$f":"'Heures Pass'!I11-'Heures Pass'!$G11","v":"00:28:45"},{"$f":"'Heures Pass'!J11-'Heures Pass'!$G11","v":"00:51:27"},{"$f":"'Heures Pass'!K11-'Heures Pass'!$G11","v":-0.39456018518518521},{"$f":"'Heures Pass'!L11-'Heures Pass'!$G11","v":"01:19:20"},{"$f":"'Heures Pass'!M11-'Heures Pass'!$G11","v":"01:41:29"}]
[{"$f":"'TEMPS-ponton'!A12","v":8},{"$f":"'TEMPS-ponton'!B12","v":"JOINVILLE AMJ 1"},{"$f":"'TEMPS-ponton'!C12","v":"Joinville"},{"$f":"'TEMPS-ponton'!D12","v":"Laurent BAUDOIN-Raphaelle BOUVIER FLORY-Sophie BUSTOS-Kastriot JAKA-Thomas AUGER"},{"$f":"VLOOKUP(A12,Equipes!A:J,2,FALSE)","v":"M"},{"$f":"ROUND(VLOOKUP(A12,Equipes!$A$2:$J$41,10,0),0)","v":46},{"$f":"'Heures Pass'!H12-'Heures Pass'!$G12","v":-0.39606481481481481},{"$f":"'Heures Pass'!I12-'Heures Pass'!$G12","v":"00:27:35"},{"$f":"'Heures Pass'!J12-'Heures Pass'!$G12","v":"00:48:05"},{"$f":"'Heures Pass'!K12-'Heures Pass'!$G12","v":-0.39606481481481481},{"$f":"'Heures Pass'!L12-'Heures Pass'!$G12","v":"01:13:43"},{"$f":"'Heures Pass'!M12-'Heures Pass'!$G12","v":"01:33:32"}]
[{"$f":"'TEMPS-ponton'!A13","v":9},{"$f":"'TEMPS-ponton'!B13","v":"NOGENT SUR MARNE CN 1"},{"$f":"'TEMPS-ponton'!C13","v":"CN 1"},{"$f":"'TEMPS-ponton'!D13","v":"Chrystelle SUPIOT-Caroline PIEDNOIRE-Olivier MUCIGNAT-Andre SIMONNET-Fabienne LORTIE"},{"$f":"VLOOKUP(A13,Equipes!A:J,2,FALSE)","v":"M"},{"$f":"ROUND(VLOOKUP(A13,Equipes!$A$2:$J$41,10,0),0)","v":53},{"$f":"'Heures Pass'!H13-'Heures Pass'!$G13","v":-0.3974421296296296},{"$f":"'Heures Pass'!I13-'Heures Pass'!$G13","v":"00:28:48"},{"$f":"'Heures Pass'!J13-'Heures Pass'!$G13","v":"00:50:22"},{"$f":"'Heures Pass'!K13-'Heures Pass'!$G13","v":-0.3974421296296296},{"$f":"'Heures Pass'!L13-'Heures Pass'!$G13","v":"01:19:39"},{"$f":"'Heures Pass'!M13-'Heures Pass'!$G13","v":"01:43:36"}]
[{"$f":"'TEMPS-ponton'!A14","v":10},{"$f":"'TEMPS-ponton'!B14","v":"NOGENT SUR MARNE CN 2"},{"$f":"'TEMPS-ponton'!C14","v":"CN2"},{"$f":"'TEMPS-ponton'!D14","v":"Christophe RUCKEBUSCH-Nicolas BURCKHART-Alice GHEERBRANT-Aurelie DONVAL-Gerard LECA"},{"$f":"VLOOKUP(A14,Equipes!A:J,2,FALSE)","v":"M"},{"$f":"ROUND(VLOOKUP(A14,Equipes!$A$2:$J$41,10,0),0)","v":53},{"$f":"'Heures Pass'!H14-'Heures Pass'!$G14","v":-0.39883101851851854},{"$f":"'Heures Pass'!I14-'Heures Pass'!$G14","v":"00:27:14"},{"$f":"'Heures Pass'!J14-'Heures Pass'!$G14","v":"00:47:45"},{"$f":"'Heures Pass'!K14-'Heures Pass'!$G14","v":-0.39883101851851854},{"$f":"'Heures Pass'!L14-'Heures Pass'!$G14","v":"01:15:26"},{"$f":"'Heures Pass'!M14-'Heures Pass'!$G14","v":"01:36:54"}]
[{"$f":"'TEMPS-ponton'!A15","v":11},{"$f":"'TEMPS-ponton'!B15","v":"BOULOGNE 92 1"},{"$f":"'TEMPS-ponton'!C15","v":"ACBB"},{"$f":"'TEMPS-ponton'!D15","v":"Viviane BALLOY-Timothé BAZIRIES-Alexandre LE FUR-Sigrid PABST-Michel VEDRINE"},{"$f":"VLOOKUP(A15,Equipes!A:J,2,FALSE)","v":"H"},{"$f":"ROUND(VLOOKUP(A15,Equipes!$A$2:$J$41,10,0),0)","v":51},{"$f":"'Heures Pass'!H15-'Heures Pass'!$G15","v":-0.40023148148148147},{"$f":"'Heures Pass'!I15-'Heures Pass'!$G15","v":"00:30:07"},{"$f":"'Heures Pass'!J15-'Heures Pass'!$G15","v":"00:54:40"},{"$f":"'Heures Pass'!K15-'Heures Pass'!$G15","v":-0.40023148148148147},{"$f":"'Heures Pass'!L15-'Heures Pass'!$G15","v":"00:25:55"},{"$f":"'Heures Pass'!M15-'Heures Pass'!$G15","v":"01:50:55"}]
[{"$f":"'TEMPS-ponton'!A16","v":12},{"$f":"'TEMPS-ponton'!B16","v":"EVRY SCA 2"},{"$f":"'TEMPS-ponton'!C16","v":"SCA2"},{"$f":"'TEMPS-ponton'!D16","v":"Laurent YEBOAH-Isabelle MOISSET FLEURISSON-Frederic DUCAUQUY-Sandrine GARCIA-Christelle MARTIN"},{"$f":"VLOOKUP(A16,Equipes!A:J,2,FALSE)","v":"M"},{"$f":"ROUND(VLOOKUP(A16,Equipes!$A$2:$J$41,10,0),0)","v":48},{"$f":"'Heures Pass'!H16-'Heures Pass'!$G16","v":-0.40160879629629631},{"$f":"'Heures Pass'!I16-'Heures Pass'!$G16","v":"00:26:14"},{"$f":"'Heures Pass'!J16-'Heures Pass'!$G16","v":"00:46:23"},{"$f":"'Heures Pass'!K16-'Heures Pass'!$G16","v":-0.40160879629629631},{"$f":"'Heures Pass'!L16-'Heures Pass'!$G16","v":"01:12:15"},{"$f":"'Heures Pass'!M16-'Heures Pass'!$G16","v":"01:31:53"}]
[{"$f":"'TEMPS-ponton'!A17","v":13},{"$f":"'TEMPS-ponton'!B17","v":"PORT-MARLY RC 2"},{"$f":"'TEMPS-ponton'!C17","v":"RCPM2"},{"$f":"'TEMPS-ponton'!D17","v":"Elsa CROZATIER-Cyrielle BERTHIER-Hervé Valette-Eric MOINARD-Anais FEUGA"},{"$f":"VLOOKUP(A17,Equipes!A:J,2,FALSE)","v":"M"},{"$f":"ROUND(VLOOKUP(A17,Equipes!$A$2:$J$41,10,0),0)","v":47},{"$f":"'Heures Pass'!H17-'Heures Pass'!$G17","v":-0.40302083333333333},{"$f":"'Heures Pass'!I17-'Heures Pass'!$G17","v":"00:25:34"},{"$f":"'Heures Pass'!J17-'Heures Pass'!$G17","v":"00:45:45"},{"$f":"'Heures Pass'!K17-'Heures Pass'!$G17","v":-0.40302083333333333},{"$f":"'Heures Pass'!L17-'Heures Pass'!$G17","v":"01:11:15"},{"$f":"'Heures Pass'!M17-'Heures Pass'!$G17","v":"01:31:59"}]
[{"$f":"'TEMPS-ponton'!A18","v":14},{"$f":"'TEMPS-ponton'!B18","v":"MAISONS MESNIL CERAMM 1"},{"$f":"'TEMPS-ponton'!C18","v":"CERAMM1"},{"$f":"'TEMPS-ponton'!D18","v":"Nicolas SCHMITT-Gloria VENDRELL-Christine MARIE LAVAUD-Amaury DE LA LAURENCIE-Amina ELABBADI"},{"$f":"VLOOKUP(A18,Equipes!A:J,2,FALSE)","v":"M"},{"$f":"ROUND(VLOOKUP(A18,Equipes!$A$2:$J$41,10,0),0)","v":50},{"$f":"'Heures Pass'!H18-'Heures Pass'!$G18","v":-0.4045023148148148},{"$f":"'Heures Pass'!I18-'Heures Pass'!$G18","v":"00:28:28"},{"$f":"'Heures Pass'!J18-'Heures Pass'!$G18","v":"00:49:52"},{"$f":"'Heures Pass'!K18-'Heures Pass'!$G18","v":-0.4045023148148148},{"$f":"'Heures Pass'!L18-'Heures Pass'!$G18","v":"01:19:15"},{"$f":"'Heures Pass'!M18-'Heures Pass'!$G18","v":"01:42:15"}]
[{"$f":"'TEMPS-ponton'!A19","v":15},{"$f":"'TEMPS-ponton'!B19","v":"SOISY SUR SEINE CN 1"},{"$f":"'TEMPS-ponton'!C19","v":"CN1"},{"$f":"'TEMPS-ponton'!D19","v":"Bertrand PIOGER-Bruno PERIQUOI-Servane BERTRAND-Alain BERNARD-Robert TRAUET"},{"$f":"VLOOKUP(A19,Equipes!A:J,2,FALSE)","v":"H"},{"$f":"ROUND(VLOOKUP(A19,Equipes!$A$2:$J$41,10,0),0)","v":54},{"$f":"'Heures Pass'!H19-'Heures Pass'!$G19","v":-0.40587962962962965},{"$f":"'Heures Pass'!I19-'Heures Pass'!$G19","v":"00:27:25"},{"$f":"'Heures Pass'!J19-'Heures Pass'!$G19","v":"00:47:07"},{"$f":"'Heures Pass'!K19-'Heures Pass'!$G19","v":-0.40587962962962965},{"$f":"'Heures Pass'!L19-'Heures Pass'!$G19","v":"01:12:51"},{"$f":"'Heures Pass'!M19-'Heures Pass'!$G19","v":"01:34:08"}]
[{"$f":"'TEMPS-ponton'!A20","v":16},{"$f":"'TEMPS-ponton'!B20","v":"PORT-MARLY RC 1"},{"$f":"'TEMPS-ponton'!C20","v":"RCPM1"},{"$f":"'TEMPS-ponton'!D20","v":"Jean-Claude LAFOREST-David CHARTIER-Christophe MARCAIS-Vincent BONTOUX-Alain ROUSSEAU"},{"$f":"VLOOKUP(A20,Equipes!A:J,2,FALSE)","v":"H"},{"$f":"ROUND(VLOOKUP(A20,Equipes!$A$2:$J$41,10,0),0)","v":55},{"$f":"'Heures Pass'!H20-'Heures Pass'!$G20","v":-0.40728009259259257},{"$f":"'Heures Pass'!I20-'Heures Pass'!$G20","v":"00:25:06"},{"$f":"'Heures Pass'!J20-'Heures Pass'!$G20","v":"00:43:56"},{"$f":"'Heures Pass'!K20-'Heures Pass'!$G20","v":-0.40728009259259257},{"$f":"'Heures Pass'!L20-'Heures Pass'!$G20","v":"01:07:04"},{"$f":"'Heures Pass'!M20-'Heures Pass'!$G20","v":"01:25:25"}]
[{"$f":"'TEMPS-ponton'!A21","v":17},{"$f":"'TEMPS-ponton'!B21","v":"ANDRESY CA CONFLUENT 1"},{"$f":"'TEMPS-ponton'!C21","v":"CAC1"},{"$f":"'TEMPS-ponton'!D21","v":"Daphne PARIZOT-Agnes BURGHGRAEVE SELLEN-Sylvie FRANSSEN-Severine LEGAILLARD-Martine LE ROUX"},{"$f":"VLOOKUP(A21,Equipes!A:J,2,FALSE)","v":"F"},{"$f":"ROUND(VLOOKUP(A21,Equipes!$A$2:$J$41,10,0),0)","v":55},{"$f":"'Heures Pass'!H21-'Heures Pass'!$G21","v":-0.40834490740740742},{"$f":"'Heures Pass'!I21-'Heures Pass'!$G21","v":"00:33:58"},{"$f":"'Heures Pass'!J21-'Heures Pass'!$G21","v":"00:59:40"},{"$f":"'Heures Pass'!K21-'Heures Pass'!$G21","v":-0.40834490740740742},{"$f":"'Heures Pass'!L21-'Heures Pass'!$G21","v":"01:34:01"},{"$f":"'Heures Pass'!M21-'Heures Pass'!$G21","v":"02:01:10"}]
[{"$f":"'TEMPS-ponton'!A22","v":18},{"$f":"'TEMPS-ponton'!B22","v":"MAISONS MESNIL CERAMM 2"},{"$f":"'TEMPS-ponton'!C22","v":"CERAMM2"},{"$f":"'TEMPS-ponton'!D22","v":"Claude LEMENAGER-Didier GIRARDEAU-Laurent LIBOTTE-Alain GIRARD-Cecile JEAMMES"},{"$f":"VLOOKUP(A22,Equipes!A:J,2,FALSE)","v":"H"},{"$f":"ROUND(VLOOKUP(A22,Equipes!$A$2:$J$41,10,0),0)","v":58},{"$f":"'Heures Pass'!H22-'Heures Pass'!$G22","v":-0.41040509259259261},{"$f":"'Heures Pass'!I22-'Heures Pass'!$G22","v":"00:28:50"},{"$f":"'Heures Pass'!J22-'Heures Pass'!$G22","v":"00:51:09"},{"$f":"'Heures Pass'!K22-'Heures Pass'!$G22","v":-0.41040509259259261},{"$f":"'Heures Pass'!L22-'Heures Pass'!$G22","v":"01:19:31"},{"$f":"'Heures Pass'!M22-'Heures Pass'!$G22","v":"01:41:38"}]
[{"$f":"'TEMPS-ponton'!A23","v":19},{"$f":"'TEMPS-ponton'!B23","v":"VILLENNES - POISSY AC 1"},{"$f":"'TEMPS-ponton'!C23","v":"ACVP1"},{"$f":"'TEMPS-ponton'!D23","v":"Olivier POLGE-Odile POLGE-Laurent BONHOMMET-Antoine VOLPI-Philippe STROHM"},{"$f":"VLOOKUP(A23,Equipes!A:J,2,FALSE)","v":"H"},{"$f":"ROUND(VLOOKUP(A23,Equipes!$A$2:$J$41,10,0),0)","v":55},{"$f":"'Heures Pass'!H23-'Heures Pass'!$G23","v":-0.41180555555555554},{"$f":"'Heures Pass'!I23-'Heures Pass'!$G23","v":"00:29:56"},{"$f":"'Heures Pass'!J23-'Heures Pass'!$G23","v":"00:52:02"},{"$f":"'Heures Pass'!K23-'Heures Pass'!$G23","v":-0.41180555555555554},{"$f":"'Heures Pass'!L23-'Heures Pass'!$G23","v":"01:19:47"},{"$f":"'Heures Pass'!M23-'Heures Pass'!$G23","v":"01:40:56"}]
[{"$f":"'TEMPS-ponton'!A24","v":20},{"$f":"'TEMPS-ponton'!B24","v":"ROUEN CNAR 1"},{"$f":"'TEMPS-ponton'!C24","v":"CNAR1"},{"$f":"'TEMPS-ponton'!D24","v":"Nathalie MOUSSET-Francois LAIR-Betty GESLAIN-Thierry DUCHESNE-Stephane MOUSSET"},{"$f":"VLOOKUP(A24,Equipes!A:J,2,FALSE)","v":"M"},{"$f":"ROUND(VLOOKUP(A24,Equipes!$A$2:$J$41,10,0),0)","v":55},{"$f":"'Heures Pass'!H24-'Heures Pass'!$G24","v":-0.41319444444444442},{"$f":"'Heures Pass'!I24-'Heures Pass'!$G24","v":"00:28:53"},{"$f":"'Heures Pass'!J24-'Heures Pass'!$G24","v":"00:50:41"},{"$f":"'Heures Pass'!K24-'Heures Pass'!$G24","v":-0.41319444444444442},{"$f":"'Heures Pass'!L24-'Heures Pass'!$G24","v":"01:17:10"},{"$f":"'Heures Pass'!M24-'Heures Pass'!$G24","v":"01:37:13"}]
[{"$f":"'TEMPS-ponton'!A25","v":21},{"$f":"'TEMPS-ponton'!B25","v":"PORT-MARLY RC 2"},{"$f":"'TEMPS-ponton'!C25","v":"RCPM2"},{"$f":"'TEMPS-ponton'!D25","v":"Guillaume CHARRON-Philippe VERHE-Stephan REYNIER-Dominique LEROUX-Luciano AUTUNNALE"},{"$f":"VLOOKUP(A25,Equipes!A:J,2,FALSE)","v":"H"},{"$f":"ROUND(VLOOKUP(A25,Equipes!$A$2:$J$41,10,0),0)","v":51},{"$f":"'Heures Pass'!H25-'Heures Pass'!$G25","v":-0.41458333333333336},{"$f":"'Heures Pass'!I25-'Heures Pass'!$G25","v":"00:25:28"},{"$f":"'Heures Pass'!J25-'Heures Pass'!$G25","v":"00:46:04"},{"$f":"'Heures Pass'!K25-'Heures Pass'!$G25","v":-0.41458333333333336},{"$f":"'Heures Pass'!L25-'Heures Pass'!$G25","v":"01:11:43"},{"$f":"'Heures Pass'!M25-'Heures Pass'!$G25","v":"01:31:40"}]
[{"$f":"'TEMPS-ponton'!A26","v":22},{"$f":"'TEMPS-ponton'!B26","v":"COUDRAY MONTCEAUX A 1"},{"$f":"'TEMPS-ponton'!C26","v":"coudray1"},{"$f":"'TEMPS-ponton'!D26","v":"Joseph RAYNAUD-Frederic MORAT-Benjamin HOUILLON-Pascal BEAUSSART-Anne HOUAL"},{"$f":"VLOOKUP(A26,Equipes!A:J,2,FALSE)","v":"H"},{"$f":"ROUND(VLOOKUP(A26,Equipes!$A$2:$J$41,10,0),0)","v":52},{"$f":"'Heures Pass'!H26-'Heures Pass'!$G26","v":-0.41597222222222224},{"$f":"'Heures Pass'!I26-'Heures Pass'!$G26","v":"00:29:10"},{"$f":"'Heures Pass'!J26-'Heures Pass'!$G26","v":"00:51:40"},{"$f":"'Heures Pass'!K26-'Heures Pass'!$G26","v":-0.41597222222222224},{"$f":"'Heures Pass'!L26-'Heures Pass'!$G26","v":"01:19:43"},{"$f":"'Heures Pass'!M26-'Heures Pass'!$G26","v":"01:41:46"}]
[{"$f":"'TEMPS-ponton'!A27","v":23},{"$f":"'TEMPS-ponton'!B27","v":"SN OISE 1"},{"$f":"'TEMPS-ponton'!C27","v":"SN Oise 1\n"},{"$f":"'TEMPS-ponton'!D27","v":"Agnes AUDEBERT-Nicolas RAUCH-Jerome ROUGE-Nathalie BAUDIER-Isabelle JOUBERT"},{"$f":"VLOOKUP(A27,Equipes!A:J,2,FALSE)","v":"M"},{"$f":"ROUND(VLOOKUP(A27,Equipes!$A$2:$J$41,10,0),0)","v":50},{"$f":"'Heures Pass'!H27-'Heures Pass'!$G27","v":-0.41666666666666669},{"$f":"'Heures Pass'!I27-'Heures Pass'!$G27","v":"00:31:24"},{"$f":"'Heures Pass'!J27-'Heures Pass'!$G27","v":"00:56:32"},{"$f":"'Heures Pass'!K27-'Heures Pass'!$G27","v":-0.41666666666666669},{"$f":"'Heures Pass'!L27-'Heures Pass'!$G27","v":"01:28:06"},{"$f":"'Heures Pass'!M27-'Heures Pass'!$G27","v":"01:53:02"}]
[{"$f":"'TEMPS-ponton'!A28","v":24},{"$f":"'TEMPS-ponton'!B28","v":"MEULAN LES MUREAUX AMMH 1"},{"$f":"'TEMPS-ponton'!C28","v":"AMMH1"},{"$f":"'TEMPS-ponton'!D28","v":"Xavier MARSAIS-Eric PRENEY-Yannick DAGMEY-David COINE-Arthur VAN SLOOTEN"},{"$f":"VLOOKUP(A28,Equipes!A:J,2,FALSE)","v":"H"},{"$f":"ROUND(VLOOKUP(A28,Equipes!$A$2:$J$41,10,0),0)","v":53},{"$f":"'Heures Pass'!H28-'Heures Pass'!$G28","v":-0.41873842592592592},{"$f":"'Heures Pass'!I28-'Heures Pass'!$G28","v":"00:26:43"},{"$f":"'Heures Pass'!J28-'Heures Pass'!$G28","v":"00:47:59"},{"$f":"'Heures Pass'!K28-'Heures Pass'!$G28","v":-0.41873842592592592},{"$f":"'Heures Pass'!L28-'Heures Pass'!$G28","v":"01:15:59"},{"$f":"'Heures Pass'!M28-'Heures Pass'!$G28","v":"01:36:04"}]
[{"$f":"'TEMPS-ponton'!A29","v":25},{"$f":"'TEMPS-ponton'!B29","v":"VILLENNES - POISSY AC 2"},{"$f":"'TEMPS-ponton'!C29","v":"ACVP2"},{"$f":"'TEMPS-ponton'!D29","v":"Franck CARIOU-Michael LE BANNER-Valerie DECAESTECKER-Karine GUILBON-Christophe ELINE"},{"$f":"VLOOKUP(A29,Equipes!A:J,2,FALSE)","v":"M"},{"$f":"ROUND(VLOOKUP(A29,Equipes!$A$2:$J$41,10,0),0)","v":54},{"$f":"'Heures Pass'!H29-'Heures Pass'!$G29","v":-0.42015046296296299},{"$f":"'Heures Pass'!I29-'Heures Pass'!$G29","v":"00:26:38"},{"$f":"'Heures Pass'!J29-'Heures Pass'!$G29","v":"00:47:47"},{"$f":"'Heures Pass'!K29-'Heures Pass'!$G29","v":-0.42015046296296299},{"$f":"'Heures Pass'!L29-'Heures Pass'!$G29","v":"01:16:13"},{"$f":"'Heures Pass'!M29-'Heures Pass'!$G29","v":"01:38:27"}]
[{"$f":"'TEMPS-ponton'!A30","v":26},{"$f":"'TEMPS-ponton'!B30","v":"EVRY SCA 1"},{"$f":"'TEMPS-ponton'!C30","v":"SCA 1"},{"$f":"'TEMPS-ponton'!D30","v":"Anne CARDUNER-Olivia PEZZOLI-Bruno CASIMIR-Lionel BOISSONNAT-Kristell MAUCHET"},{"$f":"VLOOKUP(A30,Equipes!A:J,2,FALSE)","v":"M"},{"$f":"ROUND(VLOOKUP(A30,Equipes!$A$2:$J$41,10,0),0)","v":56},{"$f":"'Heures Pass'!H30-'Heures Pass'!$G30","v":-0.42153935185185187},{"$f":"'Heures Pass'!I30-'Heures Pass'!$G30","v":"00:29:38"},{"$f":"'Heures Pass'!J30-'Heures Pass'!$G30","v":"00:52:32"},{"$f":"'Heures Pass'!K30-'Heures Pass'!$G30","v":-0.42153935185185187},{"$f":"'Heures Pass'!L30-'Heures Pass'!$G30","v":"01:22:28"},{"$f":"'Heures Pass'!M30-'Heures Pass'!$G30","v":"01:46:30"}]
[{"$f":"'TEMPS-ponton'!A31","v":27},{"$f":"'TEMPS-ponton'!B31","v":"MEULAN LES MUREAUX AMMH 1"},{"$f":"'TEMPS-ponton'!C31","v":"AMMH1"},{"$f":"'TEMPS-ponton'!D31","v":"Gwenaelle MARSAIS-Sophie SEFFAR-Catherine MARTINIER-Christelle GOANVIC-Marie LAMORE"},{"$f":"VLOOKUP(A31,Equipes!A:J,2,FALSE)","v":"F"},{"$f":"ROUND(VLOOKUP(A31,Equipes!$A$2:$J$41,10,0),0)","v":47},{"$f":"'Heures Pass'!H31-'Heures Pass'!$G31","v":-0.42292824074074076},{"$f":"'Heures Pass'!I31-'Heures Pass'!$G31","v":"00:33:14"},{"$f":"'Heures Pass'!J31-'Heures Pass'!$G31","v":"01:00:36"},{"$f":"'Heures Pass'!K31-'Heures Pass'!$G31","v":-0.42292824074074076},{"$f":"'Heures Pass'!L31-'Heures Pass'!$G31","v":"01:33:47"},{"$f":"'Heures Pass'!M31-'Heures Pass'!$G31","v":"01:59:47"}]
[{"$f":"'TEMPS-ponton'!A32","v":28},{"$f":"'TEMPS-ponton'!B32","v":"VILLENNES - POISSY AC 1"},{"$f":"'TEMPS-ponton'!C32","v":"ACVP1"},{"$f":"'TEMPS-ponton'!D32","v":"Frederic LE ROUX-Corinne HUARD-ROLLAND-Elodie DEREMIENCE-Marie-Claude LAUNAY-Olivier COSNEAU"},{"$f":"VLOOKUP(A32,Equipes!A:J,2,FALSE)","v":"M"},{"$f":"ROUND(VLOOKUP(A32,Equipes!$A$2:$J$41,10,0),0)","v":53},{"$f":"'Heures Pass'!H32-'Heures Pass'!$G32","v":-0.42442129629629627},{"$f":"'Heures Pass'!I32-'Heures Pass'!$G32","v":"00:26:14"},{"$f":"'Heures Pass'!J32-'Heures Pass'!$G32","v":"00:46:16"},{"$f":"'Heures Pass'!K32-'Heures Pass'!$G32","v":-0.42442129629629627},{"$f":"'Heures Pass'!L32-'Heures Pass'!$G32","v":"01:12:03"},{"$f":"'Heures Pass'!M32-'Heures Pass'!$G32","v":"01:31:07"}]
[{"$f":"'TEMPS-ponton'!A33","v":29},{"$f":"'TEMPS-ponton'!B33","v":"FONTAINEBLEAU APF 1"},{"$f":"'TEMPS-ponton'!C33","v":"APF1"},{"$f":"'TEMPS-ponton'!D33","v":"Kathleen SANCHEZ-Laurent FOUQUE-Christian MESSALES-Denis FLORY-David WEBER"},{"$f":"VLOOKUP(A33,Equipes!A:J,2,FALSE)","v":"H"},{"$f":"ROUND(VLOOKUP(A33,Equipes!$A$2:$J$41,10,0),0)","v":57},{"$f":"'Heures Pass'!H33-'Heures Pass'!$G33","v":-0.42569444444444443},{"$f":"'Heures Pass'!I33-'Heures Pass'!$G33","v":"00:30:14"},{"$f":"'Heures Pass'!J33-'Heures Pass'!$G33","v":"00:54:12"},{"$f":"'Heures Pass'!K33-'Heures Pass'!$G33","v":-0.42569444444444443},{"$f":"'Heures Pass'!L33-'Heures Pass'!$G33","v":"01:23:29"},{"$f":"'Heures Pass'!M33-'Heures Pass'!$G33","v":"01:48:05"}]
[{"$f":"'TEMPS-ponton'!A34","v":30},{"$f":"'TEMPS-ponton'!B34","v":"JOINVILLE AMJ 1"},{"$f":"'TEMPS-ponton'!C34","v":"AMJ1"},{"$f":"'TEMPS-ponton'!D34","v":"Vincent FABIEN-Arnaud PUPPO-Jonathan ROOKE-Xavier SUCHET-Nicolas JAMAULT"},{"$f":"VLOOKUP(A34,Equipes!A:J,2,FALSE)","v":"H"},{"$f":"ROUND(VLOOKUP(A34,Equipes!$A$2:$J$41,10,0),0)","v":51},{"$f":"'Heures Pass'!H34-'Heures Pass'!$G34","v":-0.42708333333333331},{"$f":"'Heures Pass'!I34-'Heures Pass'!$G34","v":"00:27:26"},{"$f":"'Heures Pass'!J34-'Heures Pass'!$G34","v":"00:48:39"},{"$f":"'Heures Pass'!K34-'Heures Pass'!$G34","v":-0.42708333333333331},{"$f":"'Heures Pass'!L34-'Heures Pass'!$G34","v":"01:15:15"},{"$f":"'Heures Pass'!M34-'Heures Pass'!$G34","v":"01:36:06"}]
[{"$f":"'TEMPS-ponton'!A35","v":31},{"$f":"'TEMPS-ponton'!B35","v":"NOGENT SUR MARNE CN 3"},{"$f":"'TEMPS-ponton'!C35","v":"CN3"},{"$f":"'TEMPS-ponton'!D35","v":"Alexandra COHEN SALMON-Isabelle MILON-BANNEROT-Jerome TROMBOFSKY-Olivier PASCAL-Elisabeth LAUNAY"},{"$f":"VLOOKUP(A35,Equipes!A:J,2,FALSE)","v":"M"},{"$f":"ROUND(VLOOKUP(A35,Equipes!$A$2:$J$41,10,0),0)","v":53},{"$f":"'Heures Pass'!H35-'Heures Pass'!$G35","v":-0.42850694444444443},{"$f":"'Heures Pass'!I35-'Heures Pass'!$G35","v":"00:32:03"},{"$f":"'Heures Pass'!J35-'Heures Pass'!$G35","v":"00:56:17"},{"$f":"'Heures Pass'!K35-'Heures Pass'!$G35","v":-0.42850694444444443},{"$f":"'Heures Pass'!L35-'Heures Pass'!$G35","v":"01:30:10"},{"$f":"'Heures Pass'!M35-'Heures Pass'!$G35","v":"01:56:47"}]
[{"$f":"'TEMPS-ponton'!A36","v":32},{"$f":"'TEMPS-ponton'!B36","v":"BOULOGNE 92 1"},{"$f":"'TEMPS-ponton'!C36","v":"ACBB1"},{"$f":"'TEMPS-ponton'!D36","v":"Isabelle MAIRE-Théo BEL BERBEL- LURBE-Thã‰Odore SEDAROS-Omar OUAZZANI-Alexandra MENEZES"},{"$f":"VLOOKUP(A36,Equipes!A:J,2,FALSE)","v":"H"},{"$f":"ROUND(VLOOKUP(A36,Equipes!$A$2:$J$41,10,0),0)","v":43},{"$f":"'Heures Pass'!H36-'Heures Pass'!$G36","v":"00:00:00"},{"$f":"'Heures Pass'!I36-'Heures Pass'!$G36","v":"00:00:00"},{"$f":"'Heures Pass'!J36-'Heures Pass'!$G36","v":"00:00:00"},{"$f":"'Heures Pass'!K36-'Heures Pass'!$G36","v":"00:00:00"},{"$f":"'Heures Pass'!L36-'Heures Pass'!$G36","v":"00:00:00"},{"$f":"'Heures Pass'!M36-'Heures Pass'!$G36","v":"00:00:00"}]
[{"$f":"'TEMPS-ponton'!A37","v":33},{"$f":"'TEMPS-ponton'!B37","v":"XX"},{"$f":"'TEMPS-ponton'!C37","v":"XX"},{"$f":"'TEMPS-ponton'!D37","v":"XX-XX-XX-XX-XX"},{"$f":"VLOOKUP(A37,Equipes!A:J,2,FALSE)","v":"X"},{"$f":"ROUND(VLOOKUP(A37,Equipes!$A$2:$J$41,10,0),0)","v":0},{"$f":"'Heures Pass'!H37-'Heures Pass'!$G37","v":"00:00:00"},{"$f":"'Heures Pass'!I37-'Heures Pass'!$G37","v":"00:00:00"},{"$f":"'Heures Pass'!J37-'Heures Pass'!$G37","v":"00:00:00"},{"$f":"'Heures Pass'!K37-'Heures Pass'!$G37","v":"00:00:00"},{"$f":"'Heures Pass'!L37-'Heures Pass'!$G37","v":"00:00:00"},{"$f":"'Heures Pass'!M37-'Heures Pass'!$G37","v":"00:00:00"}]
[{"$f":"'TEMPS-ponton'!A38","v":34},{"$f":"'TEMPS-ponton'!B38","v":"XX"},{"$f":"'TEMPS-ponton'!C38","v":"XX"},{"$f":"'TEMPS-ponton'!D38","v":"XX-XX-XX-XX-XX"},{"$f":"VLOOKUP(A38,Equipes!A:J,2,FALSE)","v":"X"},{"$f":"ROUND(VLOOKUP(A38,Equipes!$A$2:$J$41,10,0),0)","v":0},{"$f":"'Heures Pass'!H38-'Heures Pass'!$G38","v":-0.42996527777777777},{"$f":"'Heures Pass'!I38-'Heures Pass'!$G38","v":-0.42996527777777777},{"$f":"'Heures Pass'!J38-'Heures Pass'!$G38","v":"00:35:17"},{"$f":"'Heures Pass'!K38-'Heures Pass'!$G38","v":-0.42996527777777777},{"$f":"'Heures Pass'!L38-'Heures Pass'!$G38","v":-0.42996527777777777},{"$f":"'Heures Pass'!M38-'Heures Pass'!$G38","v":"01:04:57"}]
[{"$f":"'TEMPS-ponton'!A39","v":35},{"$f":"'TEMPS-ponton'!B39","v":"XX"},{"$f":"'TEMPS-ponton'!C39","v":"XX"},{"$f":"'TEMPS-ponton'!D39","v":"XX-XX-XX-XX-XX"},{"$f":"VLOOKUP(A39,Equipes!A:J,2,FALSE)","v":"X"},{"$f":"ROUND(VLOOKUP(A39,Equipes!$A$2:$J$41,10,0),0)","v":0},{"$f":"'Heures Pass'!H39-'Heures Pass'!$G39","v":"00:00:00"},{"$f":"'Heures Pass'!I39-'Heures Pass'!$G39","v":"00:00:00"},{"$f":"'Heures Pass'!J39-'Heures Pass'!$G39","v":"00:00:00"},{"$f":"'Heures Pass'!K39-'Heures Pass'!$G39","v":"00:00:00"},{"$f":"'Heures Pass'!L39-'Heures Pass'!$G39","v":"00:00:00"},{"$f":"'Heures Pass'!M39-'Heures Pass'!$G39","v":"00:00:00"}]
[{"$f":"'TEMPS-ponton'!A40","v":36},{"$f":"'TEMPS-ponton'!B40","v":"XX"},{"$f":"'TEMPS-ponton'!C40","v":"XX"},{"$f":"'TEMPS-ponton'!D40","v":"XX-XX-XX-XX-XX"},{"$f":"VLOOKUP(A40,Equipes!A:J,2,FALSE)","v":"X"},{"$f":"ROUND(VLOOKUP(A40,Equipes!$A$2:$J$41,10,0),0)","v":0},{"$f":"'Heures Pass'!H40-'Heures Pass'!$G40","v":"00:00:00"},{"$f":"'Heures Pass'!I40-'Heures Pass'!$G40","v":"00:00:00"},{"$f":"'Heures Pass'!J40-'Heures Pass'!$G40","v":"00:00:00"},{"$f":"'Heures Pass'!K40-'Heures Pass'!$G40","v":"00:00:00"},{"$f":"'Heures Pass'!L40-'Heures Pass'!$G40","v":"00:00:00"},{"$f":"'Heures Pass'!M40-'Heures Pass'!$G40","v":"00:00:00"}]
[{"$f":"'TEMPS-ponton'!A41","v":37},{"$f":"'TEMPS-ponton'!B41","v":"XX"},{"$f":"'TEMPS-ponton'!C41","v":"XX"},{"$f":"'TEMPS-ponton'!D41","v":"XX-XX-XX-XX-XX"},{"$f":"VLOOKUP(A41,Equipes!A:J,2,FALSE)","v":"X"},{"$f":"ROUND(VLOOKUP(A41,Equipes!$A$2:$J$41,10,0),0)","v":0},{"$f":"'Heures Pass'!H41-'Heures Pass'!$G41","v":"00:00:00"},{"$f":"'Heures Pass'!I41-'Heures Pass'!$G41","v":"00:00:00"},{"$f":"'Heures Pass'!J41-'Heures Pass'!$G41","v":"00:00:00"},{"$f":"'Heures Pass'!K41-'Heures Pass'!$G41","v":"00:00:00"},{"$f":"'Heures Pass'!L41-'Heures Pass'!$G41","v":"00:00:00"},{"$f":"'Heures Pass'!M41-'Heures Pass'!$G41","v":"00:00:00"}]
[{"$f":"'TEMPS-ponton'!A42","v":38},{"$f":"'TEMPS-ponton'!B42","v":"XX"},{"$f":"'TEMPS-ponton'!C42","v":"XX"},{"$f":"'TEMPS-ponton'!D42","v":"XX-XX-XX-XX-XX"},{"$f":"VLOOKUP(A42,Equipes!A:J,2,FALSE)","v":"X"},{"$f":"ROUND(VLOOKUP(A42,Equipes!$A$2:$J$41,10,0),0)","v":0},{"$f":"'Heures Pass'!H42-'Heures Pass'!$G42","v":"00:00:00"},{"$f":"'Heures Pass'!I42-'Heures Pass'!$G42","v":"00:00:00"},{"$f":"'Heures Pass'!J42-'Heures Pass'!$G42","v":"00:00:00"},{"$f":"'Heures Pass'!K42-'Heures Pass'!$G42","v":"00:00:00"},{"$f":"'Heures Pass'!L42-'Heures Pass'!$G42","v":"00:00:00"},{"$f":"'Heures Pass'!M42-'Heures Pass'!$G42","v":"00:00:00"}]
[{"$f":"'TEMPS-ponton'!A43","v":39},{"$f":"'TEMPS-ponton'!B43","v":"XX"},{"$f":"'TEMPS-ponton'!C43","v":"XX"},{"$f":"'TEMPS-ponton'!D43","v":"XX-XX-XX-XX-XX"},{"$f":"VLOOKUP(A43,Equipes!A:J,2,FALSE)","v":"X"},{"$f":"ROUND(VLOOKUP(A43,Equipes!$A$2:$J$41,10,0),0)","v":0},{"$f":"'Heures Pass'!H43-'Heures Pass'!$G43","v":"00:00:00"},{"$f":"'Heures Pass'!I43-'Heures Pass'!$G43","v":"00:00:00"},{"$f":"'Heures Pass'!J43-'Heures Pass'!$G43","v":"00:00:00"},{"$f":"'Heures Pass'!K43-'Heures Pass'!$G43","v":"00:00:00"},{"$f":"'Heures Pass'!L43-'Heures Pass'!$G43","v":"00:00:00"},{"$f":"'Heures Pass'!M43-'Heures Pass'!$G43","v":"00:00:00"}]
[{"$f":"'TEMPS-ponton'!A44","v":40},{"$f":"'TEMPS-ponton'!B44","v":"XX"},{"$f":"'TEMPS-ponton'!C44","v":"XX"},{"$f":"'TEMPS-ponton'!D44","v":"XX-XX-XX-XX-XX"},{"$f":"VLOOKUP(A44,Equipes!A:J,2,FALSE)","v":"X"},{"$f":"ROUND(VLOOKUP(A44,Equipes!$A$2:$J$41,10,0),0)","v":0},{"$f":"'Heures Pass'!H44-'Heures Pass'!$G44","v":"00:00:00"},{"$f":"'Heures Pass'!I44-'Heures Pass'!$G44","v":"00:00:00"},{"$f":"'Heures Pass'!J44-'Heures Pass'!$G44","v":"00:00:00"},{"$f":"'Heures Pass'!K44-'Heures Pass'!$G44","v":"00:00:00"},{"$f":"'Heures Pass'!L44-'Heures Pass'!$G44","v":"00:00:00"},{"$f":"'Heures Pass'!M44-'Heures Pass'!$G44","v":"00:00:00"}]

{"sheet":"Temps corr","index":17,"n_rows":44,"n_cols":27,"rows_kept":44,"cut":false,"hidden":false,"merged":[[2,20,2,26],[0,0,1,2],[2,13,3,13],[2,14,3,14],[2,15,3,15],[2,16,3,16],[2,17,3,17],[2,18,3,18],[0,6,1,11],[0,13,1,15],[0,16,1,18],[0,20,0,26],[1,20,1,26],[0,3,1,5]]}
["GRAND 8     ",null,null,{"$f":"'Note explicative fichier'!E3","v":"2024-06-02"},null,null,null,null,null,null,null,null,null,"SLALOM 1",null,null,"SLALOM 2",null,null,"00:01:00"," = Refus de se laisser dépasser en zone non étroite\n = Dépassement ou arrêt en zône dangereuse  et étroite"]
[null,null,null,null,null,null,null,null,null,null,null,null,null,null,null,null,null,null,null,"00:02:00"," = Slalom incorrect, non respect du parcours imposé\n = Refus de priorité au bateau avalant, au bief Villennes/migneaux"]
["Yolette N°","Club","Ville","Equipage ","Cat.","Age Moy.","Poissy-1","1 / 4\nG-8","1 / 2\nG-8","Poissy-2","3 / 4\nG-8","Arrivée",null,"Temps\nSlalom-1","Pénalité","Temps\nFinal\nSlalom 1","Temps\nSlalom-2","Pénalité","Temps\nFinal\nSlalom 2","00:05:00"," = Changement de barreur non réalisé à mi-course, face au ponton\n = Slalom « raccourci »sans remontée du courant vers Paris\n = Couper les courbes sur la  Seine"]
[{"$f":"'TEMPS-ponton'!A4","v":"Record"},{"$f":"'TEMPS-ponton'!B4","v":"POLYTECHNIQUE ( Référence 2012 )"},{"$f":"'TEMPS-ponton'!C4","v":"Palaiseau"},{"$f":"'TEMPS-ponton'!D4","v":"FERRERO Michel - Alexandre Rosinski - BOYAUD Mathieu - GODDE Olivier - THECKES Benoit"},null,null,{"$f":"'Heures Pass'!H4-'Heures Pass'!$G4","v":-0.36562499999999998},{"$f":"'Heures Pass'!I4-'Heures Pass'!$G4","v":"00:23:35"},{"$f":"'Heures Pass'!J4-'Heures Pass'!$G4","v":"00:40:41"},{"$f":"'Heures Pass'!K4-'Heures Pass'!$G4","v":-0.36562499999999998},{"$f":"'Heures Pass'!L4-'Heures Pass'!$G4","v":"01:04:34"},{"$f":"'Heures Pass'!M4-'Heures Pass'!$G4","v":"01:21:48"},null,null,null,null,null,null,null,"Total\npénalités","ponton","Sécu1","Sécu2","Sécu3","Sécu4","Sécu5","Sécu6"]
[{"$f":"'TEMPS-ponton'!A5","v":1},{"$f":"'TEMPS-ponton'!B5","v":"ANDRESY CA CONFLUENT 1"},{"$f":"'TEMPS-ponton'!C5","v":"Cac1"},{"$f":"'TEMPS-ponton'!D5","v":"Stephanie LAPORTE-Marine NACERI-Marc LACCASSAGNE-Stephane ZETTWOOG-Fouzia VOIRIN"},{"$f":"VLOOKUP(A5,Equipes!A:J,2,FALSE)","v":"M"},{"$f":"ROUND(VLOOKUP(A5,Equipes!$A$2:$J$41,10,0),0)","v":49},{"$f":"IF('Temps Pass'!G5>0,'Temps Pass'!G5,\"\")","v":""},{"$f":"IF('Temps Pass'!H5>0,'Temps Pass'!H5,\"\")","v":"00:33:20"},{"$f":"IF('Temps Pass'!I5>0,'Temps Pass'!I5,\"\")","v":"00:57:57"},{"$f":"IF('Temps Pass'!J5>0,'Temps Pass'!J5,\"\")","v":""},{"$f":"IF('Temps Pass'!K5>0,'Temps Pass'!K5,\"\")","v":"01:27:46"},{"$f":"IF('Temps Pass'!L5>0,'Temps Pass'!L5,\"99:99:99\")+T5","v":"01:56:53"},null,{"$f":"penalités!G5","v":""},{"$f":"penalités!H5","v":"00:00:00"},{"$f":"penalités!I5","v":"99:99:99"},{"$f":"penalités!J5","v":""},{"$f":"penalités!K5","v":"00:00:00"},{"$f":"penalités!L5","v":"99:99:99"},{"$f":"penalités!M5","v":"00:05:00"},{"$f":"penalités!N5","v":"00:00:00"},{"$f":"penalités!O5","v":"00:00:00"},{"$f":"penalités!P5","v":"00:00:00"},{"$f":"penalités!Q5","v":"00:05:00"},{"$f":"penalités!R5","v":"00:00:00"},{"$f":"penalités!S5","v":"00:00:00"},{"$f":"penalités!T5","v":"00:00:00"}]
[{"$f":"'TEMPS-ponton'!A6","v":2},{"$f":"'TEMPS-ponton'!B6","v":"CAUDEBEC EN CAUX ACVS 1"},{"$f":"'TEMPS-ponton'!C6","v":"Caudebec"},{"$f":"'TEMPS-ponton'!D6","v":"Martine NARBAIS-JAUREGUY-Caroline KERVRANN-Stephane DELAMARE-Nicolas BARRAY-Francois NARBAIS-JAUREGUY"},{"$f":"VLOOKUP(A6,Equipes!A:J,2,FALSE)","v":"M"},{"$f":"ROUND(VLOOKUP(A6,Equipes!$A$2:$J$41,10,0),0)","v":55},{"$f":"IF('Temps Pass'!G6>0,'Temps Pass'!G6,\"\")","v":""},{"$f":"IF('Temps Pass'!H6>0,'Temps Pass'!H6,\"\")","v":"00:30:08"},{"$f":"IF('Temps Pass'!I6>0,'Temps Pass'!I6,\"\")","v":"00:52:22"},{"$f":"IF('Temps Pass'!J6>0,'Temps Pass'!J6,\"\")","v":""},{"$f":"IF('Temps Pass'!K6>0,'Temps Pass'!K6,\"\")","v":"01:21:30"},{"$f":"IF('Temps Pass'!L6>0,'Temps Pass'!L6,\"99:99:99\")+T6","v":"01:43:47"},null,{"$f":"penalités!G6","v":""},{"$f":"penalités!H6","v":"00:00:00"},{"$f":"penalités!I6","v":"99:99:99"},{"$f":"penalités!J6","v":""},{"$f":"penalités!K6","v":"00:00:00"},{"$f":"penalités!L6","v":"99:99:99"},{"$f":"penalités!M6","v":"00:00:00"},{"$f":"penalités!N6","v":"00:00:00"},{"$f":"penalités!O6","v":"00:00:00"},{"$f":"penalités!P6","v":"00:00:00"},{"$f":"penalités!Q6","v":"00:00:00"},{"$f":"penalités!R6","v":"00:00:00"},{"$f":"penalités!S6","v":"00:00:00"},{"$f":"penalités!T6","v":"00:00:00"}]
[{"$f":"'TEMPS-ponton'!A7","v":3},{"$f":"'TEMPS-ponton'!B7","v":"ANDRESY CA CONFLUENT 2"},{"$f":"'TEMPS-ponton'!C7","v":"CAC 2"},{"$f":"'TEMPS-ponton'!D7","v":"Anna ALCALOIDEPOIXBLANC-Geoffrey GHIZZONI-Nathalie BOURGEOIS-Franck CHRISTIANNOT-NicOLAS delaunoy"},{"$f":"VLOOKUP(A7,Equipes!A:J,2,FALSE)","v":"M"},{"$f":"ROUND(VLOOKUP(A7,Equipes!$A$2:$J$41,10,0),0)","v":55},{"$f":"IF('Temps Pass'!G7>0,'Temps Pass'!G7,\"\")","v":""},{"$f":"IF('Temps Pass'!H7>0,'Temps Pass'!H7,\"\")","v":"00:33:48"},{"$f":"IF('Temps Pass'!I7>0,'Temps Pass'!I7,\"\")","v":"01:00:49"},{"$f":"IF('Temps Pass'!J7>0,'Temps Pass'!J7,\"\")","v":""},{"$f":"IF('Temps Pass'!K7>0,'Temps Pass'!K7,\"\")","v":"01:32:13"},{"$f":"IF('Temps Pass'!L7>0,'Temps Pass'!L7,\"99:99:99\")+T7","v":"01:57:49"},null,{"$f":"penalités!G7","v":""},{"$f":"penalités!H7","v":"00:00:00"},{"$f":"penalités!I7","v":"99:99:99"},{"$f":"penalités!J7","v":""},{"$f":"penalités!K7","v":"00:00:00"},{"$f":"penalités!L7","v":"99:99:99"},{"$f":"penalités!M7","v":"00:00:00"},{"$f":"penalités!N7","v":"00:00:00"},{"$f":"penalités!O7","v":"00:00:00"},{"$f":"penalités!P7","v":"00:00:00"},{"$f":"penalités!Q7","v":"00:00:00"},{"$f":"penalités!R7","v":"00:00:00"},{"$f":"penalités!S7","v":"00:00:00"},{"$f":"penalités!T7","v":"00:00:00"}]
[{"$f":"'TEMPS-ponton'!A8","v":4},{"$f":"'TEMPS-ponton'!B8","v":"ANDRESY CA CONFLUENT 1"},{"$f":"'TEMPS-ponton'!C8","v":"CAC3"},{"$f":"'TEMPS-ponton'!D8","v":"Emmanuel SALIN-Ousseni PARKOUDA-Jean-Baptiste PROVENZANO-Jerome CLAVE-Julian GALLELA"},{"$f":"VLOOKUP(A8,Equipes!A:J,2,FALSE)","v":"H"},{"$f":"ROUND(VLOOKUP(A8,Equipes!$A$2:$J$41,10,0),0)","v":46},{"$f":"IF('Temps Pass'!G8>0,'Temps Pass'!G8,\"\")","v":""},{"$f":"IF('Temps Pass'!H8>0,'Temps Pass'!H8,\"\")","v":"00:29:45"},{"$f":"IF('Temps Pass'!I8>0,'Temps Pass'!I8,\"\")","v":"00:53:48"},{"$f":"IF('Temps Pass'!J8>0,'Temps Pass'!J8,\"\")","v":""},{"$f":"IF('Temps Pass'!K8>0,'Temps Pass'!K8,\"\")","v":"01:22:46"},{"$f":"IF('Temps Pass'!L8>0,'Temps Pass'!L8,\"99:99:99\")+T8","v":"01:47:27"},null,{"$f":"penalités!G8","v":""},{"$f":"penalités!H8","v":"00:00:00"},{"$f":"penalités!I8","v":"99:99:99"},{"$f":"penalités!J8","v":""},{"$f":"penalités!K8","v":"00:00:00"},{"$f":"penalités!L8","v":"99:99:99"},{"$f":"penalités!M8","v":"00:00:00"},{"$f":"penalités!N8","v":"00:00:00"},{"$f":"penalités!O8","v":"00:00:00"},{"$f":"penalités!P8","v":"00:00:00"},{"$f":"penalités!Q8","v":"00:00:00"},{"$f":"penalités!R8","v":"00:00:00"},{"$f":"penalités!S8","v":"00:00:00"},{"$f":"penalités!T8","v":"00:00:00"}]
[{"$f":"'TEMPS-ponton'!A9","v":5},{"$f":"'TEMPS-ponton'!B9","v":"PORT-MARLY RC 1"},{"$f":"'TEMPS-ponton'!C9","v":"RCPM"},{"$f":"'TEMPS-ponton'!D9","v":"Claudie BODIN-Fanny LAMOUR-Etienne DUPUIS-Jeancharles FAUCHEUX-Gildas KETTANJIAN"},{"$f":"VLOOKUP(A9,Equipes!A:J,2,FALSE)","v":"M"},{"$f":"ROUND(VLOOKUP(A9,Equipes!$A$2:$J$41,10,0),0)","v":50},{"$f":"IF('Temps Pass'!G9>0,'Temps Pass'!G9,\"\")","v":""},{"$f":"IF('Temps Pass'!H9>0,'Temps Pass'!H9,\"\")","v":"00:30:28"},{"$f":"IF('Temps Pass'!I9>0,'Temps Pass'!I9,\"\")","v":"00:54:34"},{"$f":"IF('Temps Pass'!J9>0,'Temps Pass'!J9,\"\")","v":""},{"$f":"IF('Temps Pass'!K9>0,'Temps Pass'!K9,\"\")","v":"01:24:58"},{"$f":"IF('Temps Pass'!L9>0,'Temps Pass'!L9,\"99:99:99\")+T9","v":"01:49:12"},null,{"$f":"penalités!G9","v":""},{"$f":"penalités!H9","v":"00:00:00"},{"$f":"penalités!I9","v":"99:99:99"},{"$f":"penalités!J9","v":""},{"$f":"penalités!K9","v":"00:00:00"},{"$f":"penalités!L9","v":"99:99:99"},{"$f":"penalités!M9","v":"00:00:00"},{"$f":"penalités!N9","v":"00:00:00"},{"$f":"penalités!O9","v":"00:00:00"},{"$f":"penalités!P9","v":"00:00:00"},{"$f":"penalités!Q9","v":"00:00:00"},{"$f":"penalités!R9","v":"00:00:00"},{"$f":"penalités!S9","v":"00:00:00"},{"$f":"penalités!T9","v":"00:00:00"}]
[{"$f":"'TEMPS-ponton'!A10","v":6},{"$f":"'TEMPS-ponton'!B10","v":"BOULOGNE 92 2"},{"$f":"'TEMPS-ponton'!C10","v":"ACBB"},{"$f":"'TEMPS-ponton'!D10","v":"CéLia ROUSSELLE-Marie Pierre MARSALLON GAMBY-Françis ROBIN-Nicolas LECOEUR-Theodora XENOGIANI"},{"$f":"VLOOKUP(A10,Equipes!A:J,2,FALSE)","v":"M"},{"$f":"ROUND(VLOOKUP(A10,Equipes!$A$2:$J$41,10,0),0)","v":46},{"$f":"IF('Temps Pass'!G10>0,'Temps Pass'!G10,\"\")","v":""},{"$f":"IF('Temps Pass'!H10>0,'Temps Pass'!H10,\"\")","v":"00:28:29"},{"$f":"IF('Temps Pass'!I10>0,'Temps Pass'!I10,\"\")","v":"00:50:41"},{"$f":"IF('Temps Pass'!J10>0,'Temps Pass'!J10,\"\")","v":""},{"$f":"IF('Temps Pass'!K10>0,'Temps Pass'!K10,\"\")","v":"01:18:27"},{"$f":"IF('Temps Pass'!L10>0,'Temps Pass'!L10,\"99:99:99\")+T10","v":"01:39:43"},null,{"$f":"penalités!G10","v":""},{"$f":"penalités!H10","v":"00:00:00"},{"$f":"penalités!I10","v":"99:99:99"},{"$f":"penalités!J10","v":""},{"$f":"penalités!K10","v":"00:00:00"},{"$f":"penalités!L10","v":"99:99:99"},{"$f":"penalités!M10","v":"00:00:00"},{"$f":"penalités!N10","v":"00:00:00"},{"$f":"penalités!O10","v":"00:00:00"},{"$f":"penalités!P10","v":"00:00:00"},{"$f":"penalités!Q10","v":"00:00:00"},{"$f":"penalités!R10","v":"00:00:00"},{"$f":"penalités!S10","v":"00:00:00"},{"$f":"penalités!T10","v":"00:00:00"}]
[{"$f":"'TEMPS-ponton'!A11","v":7},{"$f":"'TEMPS-ponton'!B11","v":"VILLENNES - POISSY AC 3"},{"$f":"'TEMPS-ponton'!C11","v":"ACVP"},{"$f":"'TEMPS-ponton'!D11","v":"Virginie ALEXANDRE-Jihad LEMARQRI-Cyrille BRUZON-BASCOU-Sebastien CARPENTIER-Marie Estelle D'ARBAUMONT"},{"$f":"VLOOKUP(A11,Equipes!A:J,2,FALSE)","v":"M"},{"$f":"ROUND(VLOOKUP(A11,Equipes!$A$2:$J$41,10,0),0)","v":49},{"$f":"IF('Temps Pass'!G11>0,'Temps Pass'!G11,\"\")","v":""},{"$f":"IF('Temps Pass'!H11>0,'Temps Pass'!H11,\"\")","v":"00:28:45"},{"$f":"IF('Temps Pass'!I11>0,'Temps Pass'!I11,\"\")","v":"00:51:27"},{"$f":"IF('Temps Pass'!J11>0,'Temps Pass'!J11,\"\")","v":""},{"$f":"IF('Temps Pass'!K11>0,'Temps Pass'!K11,\"\")","v":"01:19:20"},{"$f":"IF('Temps Pass'!L11>0,'Temps Pass'!L11,\"99:99:99\")+T11","v":"01:41:29"},null,{"$f":"penalités!G11","v":""},{"$f":"penalités!H11","v":"00:00:00"},{"$f":"penalités!I11","v":"99:99:99"},{"$f":"penalités!J11","v":""},{"$f":"penalités!K11","v":"00:00:00"},{"$f":"penalités!L11","v":"99:99:99"},{"$f":"penalités!M11","v":"00:00:00"},{"$f":"penalités!N11","v":"00:00:00"},{"$f":"penalités!O11","v":"00:00:00"},{"$f":"penalités!P11","v":"00:00:00"},{"$f":"penalités!Q11","v":"00:00:00"},{"$f":"penalités!R11","v":"00:00:00"},{"$f":"penalités!S11","v":"00:00:00"},{"$f":"penalités!T11","v":"00:00:00"}]
[{"$f":"'TEMPS-ponton'!A12","v":8},{"$f":"'TEMPS-ponton'!B12","v":"JOINVILLE AMJ 1"},{"$f":"'TEMPS-ponton'!C12","v":"Joinville"},{"$f":"'TEMPS-ponton'!D12","v":"Laurent BAUDOIN-Raphaelle BOUVIER FLORY-Sophie BUSTOS-Kastriot JAKA-Thomas AUGER"},{"$f":"VLOOKUP(A12,Equipes!A:J,2,FALSE)","v":"M"},{"$f":"ROUND(VLOOKUP(A12,Equipes!$A$2:$J$41,10,0),0)","v":46},{"$f":"IF('Temps Pass'!G12>0,'Temps Pass'!G12,\"\")","v":""},{"$f":"IF('Temps Pass'!H12>0,'Temps Pass'!H12,\"\")","v":"00:27:35"},{"$f":"IF('Temps Pass'!I12>0,'Temps Pass'!I12,\"\")","v":"00:48:05"},{"$f":"IF('Temps Pass'!J12>0,'Temps Pass'!J12,\"\")","v":""},{"$f":"IF('Temps Pass'!K12>0,'Temps Pass'!K12,\"\")","v":"01:13:43"},{"$f":"IF('Temps Pass'!L12>0,'Temps Pass'!L12,\"99:99:99\")+T12","v":"01:33:32"},null,{"$f":"penalités!G12","v":""},{"$f":"penalités!H12","v":"00:00:00"},{"$f":"penalités!I12","v":"99:99:99"},{"$f":"penalités!J12","v":""},{"$f":"penalités!K12","v":"00:00:00"},{"$f":"penalités!L12","v":"99:99:99"},{"$f":"penalités!M12","v":"00:00:00"},{"$f":"penalités!N12","v":"00:00:00"},{"$f":"penalités!O12","v":"00:00:00"},{"$f":"penalités!P12","v":"00:00:00"},{"$f":"penalités!Q12","v":"00:00:00"},{"$f":"penalités!R12","v":"00:00:00"},{"$f":"penalités!S12","v":"00:00:00"},{"$f":"penalités!T12","v":"00:00:00"}]
[{"$f":"'TEMPS-ponton'!A13","v":9},{"$f":"'TEMPS-ponton'!B13","v":"NOGENT SUR MARNE CN 1"},{"$f":"'TEMPS-ponton'!C13","v":"CN 1"},{"$f":"'TEMPS-ponton'!D13","v":"Chrystelle SUPIOT-Caroline PIEDNOIRE-Olivier MUCIGNAT-Andre SIMONNET-Fabienne LORTIE"},{"$f":"VLOOKUP(A13,Equipes!A:J,2,FALSE)","v":"M"},{"$f":"ROUND(VLOOKUP(A13,Equipes!$A$2:$J$41,10,0),0)","v":53},{"$f":"IF('Temps Pass'!G13>0,'Temps Pass'!G13,\"\")","v":""},{"$f":"IF('Temps Pass'!H13>0,'Temps Pass'!H13,\"\")","v":"00:28:48"},{"$f":"IF('Temps Pass'!I13>0,'Temps Pass'!I13,\"\")","v":"00:50:22"},{"$f":"IF('Temps Pass'!J13>0,'Temps Pass'!J13,\"\")","v":""},{"$f":"IF('Temps Pass'!K13>0,'Temps Pass'!K13,\"\")","v":"01:19:39"},{"$f":"IF('Temps Pass'!L13>0,'Temps Pass'!L13,\"99:99:99\")+T13","v":"01:43:36"},null,{"$f":"penalités!G13","v":""},{"$f":"penalités!H13","v":"00:00:00"},{"$f":"penalités!I13","v":"99:99:99"},{"$f":"penalités!J13","v":""},{"$f":"penalités!K13","v":"00:00:00"},{"$f":"penalités!L13","v":"99:99:99"},{"$f":"penalités!M13","v":"00:00:00"},{"$f":"penalités!N13","v":"00:00:00"},{"$f":"penalités!O13","v":"00:00:00"},{"$f":"penalités!P13","v":"00:00:00"},{"$f":"penalités!Q13","v":"00:00:00"},{"$f":"penalités!R13","v":"00:00:00"},{"$f":"penalités!S13","v":"00:00:00"},{"$f":"penalités!T13","v":"00:00:00"}]
[{"$f":"'TEMPS-ponton'!A14","v":10},{"$f":"'TEMPS-ponton'!B14","v":"NOGENT SUR MARNE CN 2"},{"$f":"'TEMPS-ponton'!C14","v":"CN2"},{"$f":"'TEMPS-ponton'!D14","v":"Christophe RUCKEBUSCH-Nicolas BURCKHART-Alice GHEERBRANT-Aurelie DONVAL-Gerard LECA"},{"$f":"VLOOKUP(A14,Equipes!A:J,2,FALSE)","v":"M"},{"$f":"ROUND(VLOOKUP(A14,Equipes!$A$2:$J$41,10,0),0)","v":53},{"$f":"IF('Temps Pass'!G14>0,'Temps Pass'!G14,\"\")","v":""},{"$f":"IF('Temps Pass'!H14>0,'Temps Pass'!H14,\"\")","v":"00:27:14"},{"$f":"IF('Temps Pass'!I14>0,'Temps Pass'!I14,\"\")","v":"00:47:45"},{"$f":"IF('Temps Pass'!J14>0,'Temps Pass'!J14,\"\")","v":""},{"$f":"IF('Temps Pass'!K14>0,'Temps Pass'!K14,\"\")","v":"01:15:26"},{"$f":"IF('Temps Pass'!L14>0,'Temps Pass'!L14,\"99:99:99\")+T14","v":"01:36:54"},null,{"$f":"penalités!G14","v":""},{"$f":"penalités!H14","v":"00:00:00"},{"$f":"penalités!I14","v":"99:99:99"},{"$f":"penalités!J14","v":""},{"$f":"penalités!K14","v":"00:00:00"},{"$f":"penalités!L14","v":"99:99:99"},{"$f":"penalités!M14","v":"00:00:00"},{"$f":"penalités!N14","v":"00:00:00"},{"$f":"penalités!O14","v":"00:00:00"},{"$f":"penalités!P14","v":"00:00:00"},{"$f":"penalités!Q14","v":"00:00:00"},{"$f":"penalités!R14","v":"00:00:00"},{"$f":"penalités!S14","v":"00:00:00"},{"$f":"penalités!T14","v":"00:00:00"}]
[{"$f":"'TEMPS-ponton'!A15","v":11},{"$f":"'TEMPS-ponton'!B15","v":"BOULOGNE 92 1"},{"$f":"'TEMPS-ponton'!C15","v":"ACBB"},{"$f":"'TEMPS-ponton'!D15","v":"Viviane BALLOY-Timothé BAZIRIES-Alexandre LE FUR-Sigrid PABST-Michel VEDRINE"},{"$f":"VLOOKUP(A15,Equipes!A:J,2,FALSE)","v":"H"},{"$f":"ROUND(VLOOKUP(A15,Equipes!$A$2:$J$41,10,0),0)","v":51},{"$f":"IF('Temps Pass'!G15>0,'Temps Pass'!G15,\"\")","v":""},{"$f":"IF('Temps Pass'!H15>0,'Temps Pass'!H15,\"\")","v":"00:30:07"},{"$f":"IF('Temps Pass'!I15>0,'Temps Pass'!I15,\"\")","v":"00:54:40"},{"$f":"IF('Temps Pass'!J15>0,'Temps Pass'!J15,\"\")","v":""},{"$f":"IF('Temps Pass'!K15>0,'Temps Pass'!K15,\"\")","v":"00:25:55"},{"$f":"IF('Temps Pass'!L15>0,'Temps Pass'!L15,\"99:99:99\")+T15","v":"01:50:55"},null,{"$f":"penalités!G15","v":""},{"$f":"penalités!H15","v":"00:00:00"},{"$f":"penalités!I15","v":"99:99:99"},{"$f":"penalités!J15","v":""},{"$f":"penalités!K15","v":"00:00:00"},{"$f":"penalités!L15","v":"99:99:99"},{"$f":"penalités!M15","v":"00:00:00"},{"$f":"penalités!N15","v":"00:00:00"},{"$f":"penalités!O15","v":"00:00:00"},{"$f":"penalités!P15","v":"00:00:00"},{"$f":"penalités!Q15","v":"00:00:00"},{"$f":"penalités!R15","v":"00:00:00"},{"$f":"penalités!S15","v":"00:00:00"},{"$f":"penalités!T15","v":"00:00:00"}]
[{"$f":"'TEMPS-ponton'!A16","v":12},{"$f":"'TEMPS-ponton'!B16","v":"EVRY SCA 2"},{"$f":"'TEMPS-ponton'!C16","v":"SCA2"},{"$f":"'TEMPS-ponton'!D16","v":"Laurent YEBOAH-Isabelle MOISSET FLEURISSON-Frederic DUCAUQUY-Sandrine GARCIA-Christelle MARTIN"},{"$f":"VLOOKUP(A16,Equipes!A:J,2,FALSE)","v":"M"},{"$f":"ROUND(VLOOKUP(A16,Equipes!$A$2:$J$41,10,0),0)","v":48},{"$f":"IF('Temps Pass'!G16>0,'Temps Pass'!G16,\"\")","v":""},{"$f":"IF('Temps Pass'!H16>0,'Temps Pass'!H16,\"\")","v":"00:26:14"},{"$f":"IF('Temps Pass'!I16>0,'Temps Pass'!I16,\"\")","v":"00:46:23"},{"$f":"IF('Temps Pass'!J16>0,'Temps Pass'!J16,\"\")","v":""},{"$f":"IF('Temps Pass'!K16>0,'Temps Pass'!K16,\"\")","v":"01:12:15"},{"$f":"IF('Temps Pass'!L16>0,'Temps Pass'!L16,\"99:99:99\")+T16","v":"01:36:53"},null,{"$f":"penalités!G16","v":""},{"$f":"penalités!H16","v":"00:00:00"},{"$f":"penalités!I16","v":"99:99:99"},{"$f":"penalités!J16","v":""},{"$f":"penalités!K16","v":"00:00:00"},{"$f":"penalités!L16","v":"99:99:99"},{"$f":"penalités!M16","v":"00:05:00"},{"$f":"penalités!N16","v":"00:05:00"},{"$f":"penalités!O16","v":"00:00:00"},{"$f":"penalités!P16","v":"00:00:00"},{"$f":"penalités!Q16","v":"00:00:00"},{"$f":"penalités!R16","v":"00:00:00"},{"$f":"penalités!S16","v":"00:00:00"},{"$f":"penalités!T16","v":"00:00:00"}]
[{"$f":"'TEMPS-ponton'!A17","v":13},{"$f":"'TEMPS-ponton'!B17","v":"PORT-MARLY RC 2"},{"$f":"'TEMPS-ponton'!C17","v":"RCPM2"},{"$f":"'TEMPS-ponton'!D17","v":"Elsa CROZATIER-Cyrielle BERTHIER-Hervé Valette-Eric MOINARD-Anais FEUGA"},{"$f":"VLOOKUP(A17,Equipes!A:J,2,FALSE)","v":"M"},{"$f":"ROUND(VLOOKUP(A17,Equipes!$A$2:$J$41,10,0),0)","v":47},{"$f":"IF('Temps Pass'!G17>0,'Temps Pass'!G17,\"\")","v":""},{"$f":"IF('Temps Pass'!H17>0,'Temps Pass'!H17,\"\")","v":"00:25:34"},{"$f":"IF('Temps Pass'!I17>0,'Temps Pass'!I17,\"\")","v":"00:45:45"},{"$f":"IF('Temps Pass'!J17>0,'Temps Pass'!J17,\"\")","v":""},{"$f":"IF('Temps Pass'!K17>0,'Temps Pass'!K17,\"\")","v":"01:11:15"},{"$f":"IF('Temps Pass'!L17>0,'Temps Pass'!L17,\"99:99:99\")+T17","v":"01:36:59"},null,{"$f":"penalités!G17","v":""},{"$f":"penalités!H17","v":"00:00:00"},{"$f":"penalités!I17","v":"99:99:99"},{"$f":"penalités!J17","v":""},{"$f":"penalités!K17","v":"00:00:00"},{"$f":"penalités!L17","v":"99:99:99"},{"$f":"penalités!M17","v":"00:05:00"},{"$f":"penalités!N17","v":"00:05:00"},{"$f":"penalités!O17","v":"00:00:00"},{"$f":"penalités!P17","v":"00:00:00"},{"$f":"penalités!Q17","v":"00:00:00"},{"$f":"penalités!R17","v":"00:00:00"},{"$f":"penalités!S17","v":"00:00:00"},{"$f":"penalités!T17","v":"00:00:00"}]
[{"$f":"'TEMPS-ponton'!A18","v":14},{"$f":"'TEMPS-ponton'!B18","v":"MAISONS MESNIL CERAMM 1"},{"$f":"'TEMPS-ponton'!C18","v":"CERAMM1"},{"$f":"'TEMPS-ponton'!D18","v":"Nicolas SCHMITT-Gloria VENDRELL-Christine MARIE LAVAUD-Amaury DE LA LAURENCIE-Amina ELABBADI"},{"$f":"VLOOKUP(A18,Equipes!A:J,2,FALSE)","v":"M"},{"$f":"ROUND(VLOOKUP(A18,Equipes!$A$2:$J$41,10,0),0)","v":50},{"$f":"IF('Temps Pass'!G18>0,'Temps Pass'!G18,\"\")","v":""},{"$f":"IF('Temps Pass'!H18>0,'Temps Pass'!H18,\"\")","v":"00:28:28"},{"$f":"IF('Temps Pass'!I18>0,'Temps Pass'!I18,\"\")","v":"00:49:52"},{"$f":"IF('Temps Pass'!J18>0,'Temps Pass'!J18,\"\")","v":""},{"$f":"IF('Temps Pass'!K18>0,'Temps Pass'!K18,\"\")","v":"01:19:15"},{"$f":"IF('Temps Pass'!L18>0,'Temps Pass'!L18,\"99:99:99\")+T18","v":"01:42:15"},null,{"$f":"penalités!G18","v":""},{"$f":"penalités!H18","v":"00:00:00"},{"$f":"penalités!I18","v":"99:99:99"},{"$f":"penalités!J18","v":""},{"$f":"penalités!K18","v":"00:00:00"},{"$f":"penalités!L18","v":"99:99:99"},{"$f":"penalités!M18","v":"00:00:00"},{"$f":"penalités!N18","v":"00:00:00"},{"$f":"penalités!O18","v":"00:00:00"},{"$f":"penalités!P18","v":"00:00:00"},{"$f":"penalités!Q18","v":"00:00:00"},{"$f":"penalités!R18","v":"00:00:00"},{"$f":"penalités!S18","v":"00:00:00"},{"$f":"penalités!T18","v":"00:00:00"}]
[{"$f":"'TEMPS-ponton'!A19","v":15},{"$f":"'TEMPS-ponton'!B19","v":"SOISY SUR SEINE CN 1"},{"$f":"'TEMPS-ponton'!C19","v":"CN1"},{"$f":"'TEMPS-ponton'!D19","v":"Bertrand PIOGER-Bruno PERIQUOI-Servane BERTRAND-Alain BERNARD-Robert TRAUET"},{"$f":"VLOOKUP(A19,Equipes!A:J,2,FALSE)","v":"H"},{"$f":"ROUND(VLOOKUP(A19,Equipes!$A$2:$J$41,10,0),0)","v":54},{"$f":"IF('Temps Pass'!G19>0,'Temps Pass'!G19,\"\")","v":""},{"$f":"IF('Temps Pass'!H19>0,'Temps Pass'!H19,\"\")","v":"00:27:25"},{"$f":"IF('Temps Pass'!I19>0,'Temps Pass'!I19,\"\")","v":"00:47:07"},{"$f":"IF('Temps Pass'!J19>0,'Temps Pass'!J19,\"\")","v":""},{"$f":"IF('Temps Pass'!K19>0,'Temps Pass'!K19,\"\")","v":"01:12:51"},{"$f":"IF('Temps Pass'!L19>0,'Temps Pass'!L19,\"99:99:99\")+T19","v":"01:39:08"},null,{"$f":"penalités!G19","v":""},{"$f":"penalités!H19","v":"00:00:00"},{"$f":"penalités!I19","v":"99:99:99"},{"$f":"penalités!J19","v":""},{"$f":"penalités!K19","v":"00:00:00"},{"$f":"penalités!L19","v":"99:99:99"},{"$f":"penalités!M19","v":"00:05:00"},{"$f":"penalités!N19","v":"00:00:00"},{"$f":"penalités!O19","v":"00:00:00"},{"$f":"penalités!P19","v":"00:00:00"},{"$f":"penalités!Q19","v":"00:05:00"},{"$f":"penalités!R19","v":"00:00:00"},{"$f":"penalités!S19","v":"00:00:00"},{"$f":"penalités!T19","v":"00:00:00"}]
[{"$f":"'TEMPS-ponton'!A20","v":16},{"$f":"'TEMPS-ponton'!B20","v":"PORT-MARLY RC 1"},{"$f":"'TEMPS-ponton'!C20","v":"RCPM1"},{"$f":"'TEMPS-ponton'!D20","v":"Jean-Claude LAFOREST-David CHARTIER-Christophe MARCAIS-Vincent BONTOUX-Alain ROUSSEAU"},{"$f":"VLOOKUP(A20,Equipes!A:J,2,FALSE)","v":"H"},{"$f":"ROUND(VLOOKUP(A20,Equipes!$A$2:$J$41,10,0),0)","v":55},{"$f":"IF('Temps Pass'!G20>0,'Temps Pass'!G20,\"\")","v":""},{"$f":"IF('Temps Pass'!H20>0,'Temps Pass'!H20,\"\")","v":"00:25:06"},{"$f":"IF('Temps Pass'!I20>0,'Temps Pass'!I20,\"\")","v":"00:43:56"},{"$f":"IF('Temps Pass'!J20>0,'Temps Pass'!J20,\"\")","v":""},{"$f":"IF('Temps Pass'!K20>0,'Temps Pass'!K20,\"\")","v":"01:07:04"},{"$f":"IF('Temps Pass'!L20>0,'Temps Pass'!L20,\"99:99:99\")+T20","v":"01:30:25"},null,{"$f":"penalités!G20","v":""},{"$f":"penalités!H20","v":"00:00:00"},{"$f":"penalités!I20","v":"99:99:99"},{"$f":"penalités!J20","v":""},{"$f":"penalités!K20","v":"00:00:00"},{"$f":"penalités!L20","v":"99:99:99"},{"$f":"penalités!M20","v":"00:05:00"},{"$f":"penalités!N20","v":"00:00:00"},{"$f":"penalités!O20","v":"00:00:00"},{"$f":"penalités!P20","v":"00:00:00"},{"$f":"penalités!Q20","v":"00:05:00"},{"$f":"penalités!R20","v":"00:00:00"},{"$f":"penalités!S20","v":"00:00:00"},{"$f":"penalités!T20","v":"00:00:00"}]
[{"$f":"'TEMPS-ponton'!A21","v":17},{"$f":"'TEMPS-ponton'!B21","v":"ANDRESY CA CONFLUENT 1"},{"$f":"'TEMPS-ponton'!C21","v":"CAC1"},{"$f":"'TEMPS-ponton'!D21","v":"Daphne PARIZOT-Agnes BURGHGRAEVE SELLEN-Sylvie FRANSSEN-Severine LEGAILLARD-Martine LE ROUX"},{"$f":"VLOOKUP(A21,Equipes!A:J,2,FALSE)","v":"F"},{"$f":"ROUND(VLOOKUP(A21,Equipes!$A$2:$J$41,10,0),0)","v":55},{"$f":"IF('Temps Pass'!G21>0,'Temps Pass'!G21,\"\")","v":""},{"$f":"IF('Temps Pass'!H21>0,'Temps Pass'!H21,\"\")","v":"00:33:58"},{"$f":"IF('Temps Pass'!I21>0,'Temps Pass'!I21,\"\")","v":"00:59:40"},{"$f":"IF('Temps Pass'!J21>0,'Temps Pass'!J21,\"\")","v":""},{"$f":"IF('Temps Pass'!K21>0,'Temps Pass'!K21,\"\")","v":"01:34:01"},{"$f":"IF('Temps Pass'!L21>0,'Temps Pass'!L21,\"99:99:99\")+T21","v":"02:01:10"},null,{"$f":"penalités!G21","v":""},{"$f":"penalités!H21","v":"00:00:00"},{"$f":"penalités!I21","v":"99:99:99"},{"$f":"penalités!J21","v":""},{"$f":"penalités!K21","v":"00:00:00"},{"$f":"penalités!L21","v":"99:99:99"},{"$f":"penalités!M21","v":"00:00:00"},{"$f":"penalités!N21","v":"00:00:00"},{"$f":"penalités!O21","v":"00:00:00"},{"$f":"penalités!P21","v":"00:00:00"},{"$f":"penalités!Q21","v":"00:00:00"},{"$f":"penalités!R21","v":"00:00:00"},{"$f":"penalités!S21","v":"00:00:00"},{"$f":"penalités!T21","v":"00:00:00"}]
[{"$f":"'TEMPS-ponton'!A22","v":18},{"$f":"'TEMPS-ponton'!B22","v":"MAISONS MESNIL CERAMM 2"},{"$f":"'TEMPS-ponton'!C22","v":"CERAMM2"},{"$f":"'TEMPS-ponton'!D22","v":"Claude LEMENAGER-Didier GIRARDEAU-Laurent LIBOTTE-Alain GIRARD-Cecile JEAMMES"},{"$f":"VLOOKUP(A22,Equipes!A:J,2,FALSE)","v":"H"},{"$f":"ROUND(VLOOKUP(A22,Equipes!$A$2:$J$41,10,0),0)","v":58},{"$f":"IF('Temps Pass'!G22>0,'Temps Pass'!G22,\"\")","v":""},{"$f":"IF('Temps Pass'!H22>0,'Temps Pass'!H22,\"\")","v":"00:28:50"},{"$f":"IF('Temps Pass'!I22>0,'Temps Pass'!I22,\"\")","v":"00:51:09"},{"$f":"IF('Temps Pass'!J22>0,'Temps Pass'!J22,\"\")","v":""},{"$f":"IF('Temps Pass'!K22>0,'Temps Pass'!K22,\"\")","v":"01:19:31"},{"$f":"IF('Temps Pass'!L22>0,'Temps Pass'!L22,\"99:99:99\")+T22","v":"01:41:38"},null,{"$f":"penalités!G22","v":""},{"$f":"penalités!H22","v":"00:00:00"},{"$f":"penalités!I22","v":"99:99:99"},{"$f":"penalités!J22","v":""},{"$f":"penalités!K22","v":"00:00:00"},{"$f":"penalités!L22","v":"99:99:99"},{"$f":"penalités!M22","v":"00:00:00"},{"$f":"penalités!N22","v":"00:00:00"},{"$f":"penalités!O22","v":"00:00:00"},{"$f":"penalités!P22","v":"00:00:00"},{"$f":"penalités!Q22","v":"00:00:00"},{"$f":"penalités!R22","v":"00:00:00"},{"$f":"penalités!S22","v":"00:00:00"},{"$f":"penalités!T22","v":"00:00:00"}]
[{"$f":"'TEMPS-ponton'!A23","v":19},{"$f":"'TEMPS-ponton'!B23","v":"VILLENNES - POISSY AC 1"},{"$f":"'TEMPS-ponton'!C23","v":"ACVP1"},{"$f":"'TEMPS-ponton'!D23","v":"Olivier POLGE-Odile POLGE-Laurent BONHOMMET-Antoine VOLPI-Philippe STROHM"},{"$f":"VLOOKUP(A23,Equipes!A:J,2,FALSE)","v":"H"},{"$f":"ROUND(VLOOKUP(A23,Equipes!$A$2:$J$41,10,0),0)","v":55},{"$f":"IF('Temps Pass'!G23>0,'Temps Pass'!G23,\"\")","v":""},{"$f":"IF('Temps Pass'!H23>0,'Temps Pass'!H23,\"\")","v":"00:29:56"},{"$f":"IF('Temps Pass'!I23>0,'Temps Pass'!I23,\"\")","v":"00:52:02"},{"$f":"IF('Temps Pass'!J23>0,'Temps Pass'!J23,\"\")","v":""},{"$f":"IF('Temps Pass'!K23>0,'Temps Pass'!K23,\"\")","v":"01:19:47"},{"$f":"IF('Temps Pass'!L23>0,'Temps Pass'!L23,\"99:99:99\")+T23","v":"01:40:56"},null,{"$f":"penalités!G23","v":""},{"$f":"penalités!H23","v":"00:00:00"},{"$f":"penalités!I23","v":"99:99:99"},{"$f":"penalités!J23","v":""},{"$f":"penalités!K23","v":"00:00:00"},{"$f":"penalités!L23","v":"99:99:99"},{"$f":"penalités!M23","v":"00:00:00"},{"$f":"penalités!N23","v":"00:00:00"},{"$f":"penalités!O23","v":"00:00:00"},{"$f":"penalités!P23","v":"00:00:00"},{"$f":"penalités!Q23","v":"00:00:00"},{"$f":"penalités!R23","v":"00:00:00"},{"$f":"penalités!S23","v":"00:00:00"},{"$f":"penalités!T23","v":"00:00:00"}]
[{"$f":"'TEMPS-ponton'!A24","v":20},{"$f":"'TEMPS-ponton'!B24","v":"ROUEN CNAR 1"},{"$f":"'TEMPS-ponton'!C24","v":"CNAR1"},{"$f":"'TEMPS-ponton'!D24","v":"Nathalie MOUSSET-Francois LAIR-Betty GESLAIN-Thierry DUCHESNE-Stephane MOUSSET"},{"$f":"VLOOKUP(A24,Equipes!A:J,2,FALSE)","v":"M"},{"$f":"ROUND(VLOOKUP(A24,Equipes!$A$2:$J$41,10,0),0)","v":55},{"$f":"IF('Temps Pass'!G24>0,'Temps Pass'!G24,\"\")","v":""},{"$f":"IF('Temps Pass'!H24>0,'Temps Pass'!H24,\"\")","v":"00:28:53"},{"$f":"IF('Temps Pass'!I24>0,'Temps Pass'!I24,\"\")","v":"00:50:41"},{"$f":"IF('Temps Pass'!J24>0,'Temps Pass'!J24,\"\")","v":""},{"$f":"IF('Temps Pass'!K24>0,'Temps Pass'!K24,\"\")","v":"01:17:10"},{"$f":"IF('Temps Pass'!L24>0,'Temps Pass'!L24,\"99:99:99\")+T24","v":"01:37:13"},null,{"$f":"penalités!G24","v":""},{"$f":"penalités!H24","v":"00:00:00"},{"$f":"penalités!I24","v":"99:99:99"},{"$f":"penalités!J24","v":""},{"$f":"penalités!K24","v":"00:00:00"},{"$f":"penalités!L24","v":"99:99:99"},{"$f":"penalités!M24","v":"00:00:00"},{"$f":"penalités!N24","v":"00:00:00"},{"$f":"penalités!O24","v":"00:00:00"},{"$f":"penalités!P24","v":"00:00:00"},{"$f":"penalités!Q24","v":"00:00:00"},{"$f":"penalités!R24","v":"00:00:00"},{"$f":"penalités!S24","v":"00:00:00"},{"$f":"penalités!T24","v":"00:00:00"}]
[{"$f":"'TEMPS-ponton'!A25","v":21},{"$f":"'TEMPS-ponton'!B25","v":"PORT-MARLY RC 2"},{"$f":"'TEMPS-ponton'!C25","v":"RCPM2"},{"$f":"'TEMPS-ponton'!D25","v":"Guillaume CHARRON-Philippe VERHE-Stephan REYNIER-Dominique LEROUX-Luciano AUTUNNALE"},{"$f":"VLOOKUP(A25,Equipes!A:J,2,FALSE)","v":"H"},{"$f":"ROUND(VLOOKUP(A25,Equipes!$A$2:$J$41,10,0),0)","v":51},{"$f":"IF('Temps Pass'!G25>0,'Temps Pass'!G25,\"\")","v":""},{"$f":"IF('Temps Pass'!H25>0,'Temps Pass'!H25,\"\")","v":"00:25:28"},{"$f":"IF('Temps Pass'!I25>0,'Temps Pass'!I25,\"\")","v":"00:46:04"},{"$f":"IF('Temps Pass'!J25>0,'Temps Pass'!J25,\"\")","v":""},{"$f":"IF('Temps Pass'!K25>0,'Temps Pass'!K25,\"\")","v":"01:11:43"},{"$f":"IF('Temps Pass'!L25>0,'Temps Pass'!L25,\"99:99:99\")+T25","v":"01:31:40"},null,{"$f":"penalités!G25","v":""},{"$f":"penalités!H25","v":"00:00:00"},{"$f":"penalités!I25","v":"99:99:99"},{"$f":"penalités!J25","v":""},{"$f":"penalités!K25","v":"00:00:00"},{"$f":"penalités!L25","v":"99:99:99"},{"$f":"penalités!M25","v":"00:00:00"},{"$f":"penalités!N25","v":"00:00:00"},{"$f":"penalités!O25","v":"00:00:00"},{"$f":"penalités!P25","v":"00:00:00"},{"$f":"penalités!Q25","v":"00:00:00"},{"$f":"penalités!R25","v":"00:00:00"},{"$f":"penalités!S25","v":"00:00:00"},{"$f":"penalités!T25","v":"00:00:00"}]
[{"$f":"'TEMPS-ponton'!A26","v":22},{"$f":"'TEMPS-ponton'!B26","v":"COUDRAY MONTCEAUX A 1"},{"$f":"'TEMPS-ponton'!C26","v":"coudray1"},{"$f":"'TEMPS-ponton'!D26","v":"Joseph RAYNAUD-Frederic MORAT-Benjamin HOUILLON-Pascal BEAUSSART-Anne HOUAL"},{"$f":"VLOOKUP(A26,Equipes!A:J,2,FALSE)","v":"H"},{"$f":"ROUND(VLOOKUP(A26,Equipes!$A$2:$J$41,10,0),0)","v":52},{"$f":"IF('Temps Pass'!G26>0,'Temps Pass'!G26,\"\")","v":""},{"$f":"IF('Temps Pass'!H26>0,'Temps Pass'!H26,\"\")","v":"00:29:10"},{"$f":"IF('Temps Pass'!I26>0,'Temps Pass'!I26,\"\")","v":"00:51:40"},{"$f":"IF('Temps Pass'!J26>0,'Temps Pass'!J26,\"\")","v":""},{"$f":"IF('Temps Pass'!K26>0,'Temps Pass'!K26,\"\")","v":"01:19:43"},{"$f":"IF('Temps Pass'!L26>0,'Temps Pass'!L26,\"99:99:99\")+T26","v":"01:41:46"},null,{"$f":"penalités!G26","v":""},{"$f":"penalités!H26","v":"00:00:00"},{"$f":"penalités!I26","v":"99:99:99"},{"$f":"penalités!J26","v":""},{"$f":"penalités!K26","v":"00:00:00"},{"$f":"penalités!L26","v":"99:99:99"},{"$f":"penalités!M26","v":"00:00:00"},{"$f":"penalités!N26","v":"00:00:00"},{"$f":"penalités!O26","v":"00:00:00"},{"$f":"penalités!P26","v":"00:00:00"},{"$f":"penalités!Q26","v":"00:00:00"},{"$f":"penalités!R26","v":"00:00:00"},{"$f":"penalités!S26","v":"00:00:00"},{"$f":"penalités!T26","v":"00:00:00"}]
[{"$f":"'TEMPS-ponton'!A27","v":23},{"$f":"'TEMPS-ponton'!B27","v":"SN OISE 1"},{"$f":"'TEMPS-ponton'!C27","v":"SN Oise 1\n"},{"$f":"'TEMPS-ponton'!D27","v":"Agnes AUDEBERT-Nicolas RAUCH-Jerome ROUGE-Nathalie BAUDIER-Isabelle JOUBERT"},{"$f":"VLOOKUP(A27,Equipes!A:J,2,FALSE)","v":"M"},{"$f":"ROUND(VLOOKUP(A27,Equipes!$A$2:$J$41,10,0),0)","v":50},{"$f":"IF('Temps Pass'!G27>0,'Temps Pass'!G27,\"\")","v":""},{"$f":"IF('Temps Pass'!H27>0,'Temps Pass'!H27,\"\")","v":"00:31:24"},{"$f":"IF('Temps Pass'!I27>0,'Temps Pass'!I27,\"\")","v":"00:56:32"},{"$f":"IF('Temps Pass'!J27>0,'Temps Pass'!J27,\"\")","v":""},{"$f":"IF('Temps Pass'!K27>0,'Temps Pass'!K27,\"\")","v":"01:28:06"},{"$f":"IF('Temps Pass'!L27>0,'Temps Pass'!L27,\"99:99:99\")+T27","v":"01:53:02"},null,{"$f":"penalités!G27","v":""},{"$f":"penalités!H27","v":"00:00:00"},{"$f":"penalités!I27","v":"99:99:99"},{"$f":"penalités!J27","v":""},{"$f":"penalités!K27","v":"00:00:00"},{"$f":"penalités!L27","v":"99:99:99"},{"$f":"penalités!M27","v":"00:00:00"},{"$f":"penalités!N27","v":"00:00:00"},{"$f":"penalités!O27","v":"00:00:00"},{"$f":"penalités!P27","v":"00:00:00"},{"$f":"penalités!Q27","v":"00:00:00"},{"$f":"penalités!R27","v":"00:00:00"},{"$f":"penalités!S27","v":"00:00:00"},{"$f":"penalités!T27","v":"00:00:00"}]
[{"$f":"'TEMPS-ponton'!A28","v":24},{"$f":"'TEMPS-ponton'!B28","v":"MEULAN LES MUREAUX AMMH 1"},{"$f":"'TEMPS-ponton'!C28","v":"AMMH1"},{"$f":"'TEMPS-ponton'!D28","v":"Xavier MARSAIS-Eric PRENEY-Yannick DAGMEY-David COINE-Arthur VAN SLOOTEN"},{"$f":"VLOOKUP(A28,Equipes!A:J,2,FALSE)","v":"H"},{"$f":"ROUND(VLOOKUP(A28,Equipes!$A$2:$J$41,10,0),0)","v":53},{"$f":"IF('Temps Pass'!G28>0,'Temps Pass'!G28,\"\")","v":""},{"$f":"IF('Temps Pass'!H28>0,'Temps Pass'!H28,\"\")","v":"00:26:43"},{"$f":"IF('Temps Pass'!I28>0,'Temps Pass'!I28,\"\")","v":"00:47:59"},{"$f":"IF('Temps Pass'!J28>0,'Temps Pass'!J28,\"\")","v":""},{"$f":"IF('Temps Pass'!K28>0,'Temps Pass'!K28,\"\")","v":"01:15:59"},{"$f":"IF('Temps Pass'!L28>0,'Temps Pass'!L28,\"99:99:99\")+T28","v":"01:36:04"},null,{"$f":"penalités!G28","v":""},{"$f":"penalités!H28","v":"00:00:00"},{"$f":"penalités!I28","v":"99:99:99"},{"$f":"penalités!J28","v":""},{"$f":"penalités!K28","v":"00:00:00"},{"$f":"penalités!L28","v":"99:99:99"},{"$f":"penalités!M28","v":"00:00:00"},{"$f":"penalités!N28","v":"00:00:00"},{"$f":"penalités!O28","v":"00:00:00"},{"$f":"penalités!P28","v":"00:00:00"},{"$f":"penalités!Q28","v":"00:00:00"},{"$f":"penalités!R28","v":"00:00:00"},{"$f":"penalités!S28","v":"00:00:00"},{"$f":"penalités!T28","v":"00:00:00"}]
[{"$f":"'TEMPS-ponton'!A29","v":25},{"$f":"'TEMPS-ponton'!B29","v":"VILLENNES - POISSY AC 2"},{"$f":"'TEMPS-ponton'!C29","v":"ACVP2"},{"$f":"'TEMPS-ponton'!D29","v":"Franck CARIOU-Michael LE BANNER-Valerie DECAESTECKER-Karine GUILBON-Christophe ELINE"},{"$f":"VLOOKUP(A29,Equipes!A:J,2,FALSE)","v":"M"},{"$f":"ROUND(VLOOKUP(A29,Equipes!$A$2:$J$41,10,0),0)","v":54},{"$f":"IF('Temps Pass'!G29>0,'Temps Pass'!G29,\"\")","v":""},{"$f":"IF('Temps Pass'!H29>0,'Temps Pass'!H29,\"\")","v":"00:26:38"},{"$f":"IF('Temps Pass'!I29>0,'Temps Pass'!I29,\"\")","v":"00:47:47"},{"$f":"IF('Temps Pass'!J29>0,'Temps Pass'!J29,\"\")","v":""},{"$f":"IF('Temps Pass'!K29>0,'Temps Pass'!K29,\"\")","v":"01:16:13"},{"$f":"IF('Temps Pass'!L29>0,'Temps Pass'!L29,\"99:99:99\")+T29","v":"01:38:27"},null,{"$f":"penalités!G29","v":""},{"$f":"penalités!H29","v":"00:00:00"},{"$f":"penalités!I29","v":"99:99:99"},{"$f":"penalités!J29","v":""},{"$f":"penalités!K29","v":"00:00:00"},{"$f":"penalités!L29","v":"99:99:99"},{"$f":"penalités!M29","v":"00:00:00"},{"$f":"penalités!N29","v":"00:00:00"},{"$f":"penalités!O29","v":"00:00:00"},{"$f":"penalités!P29","v":"00:00:00"},{"$f":"penalités!Q29","v":"00:00:00"},{"$f":"penalités!R29","v":"00:00:00"},{"$f":"penalités!S29","v":"00:00:00"},{"$f":"penalités!T29","v":"00:00:00"}]
[{"$f":"'TEMPS-ponton'!A30","v":26},{"$f":"'TEMPS-ponton'!B30","v":"EVRY SCA 1"},{"$f":"'TEMPS-ponton'!C30","v":"SCA 1"},{"$f":"'TEMPS-ponton'!D30","v":"Anne CARDUNER-Olivia PEZZOLI-Bruno CASIMIR-Lionel BOISSONNAT-Kristell MAUCHET"},{"$f":"VLOOKUP(A30,Equipes!A:J,2,FALSE)","v":"M"},{"$f":"ROUND(VLOOKUP(A30,Equipes!$A$2:$J$41,10,0),0)","v":56},{"$f":"IF('Temps Pass'!G30>0,'Temps Pass'!G30,\"\")","v":""},{"$f":"IF('Temps Pass'!H30>0,'Temps Pass'!H30,\"\")","v":"00:29:38"},{"$f":"IF('Temps Pass'!I30>0,'Temps Pass'!I30,\"\")","v":"00:52:32"},{"$f":"IF('Temps Pass'!J30>0,'Temps Pass'!J30,\"\")","v":""},{"$f":"IF('Temps Pass'!K30>0,'Temps Pass'!K30,\"\")","v":"01:22:28"},{"$f":"IF('Temps Pass'!L30>0,'Temps Pass'!L30,\"99:99:99\")+T30","v":"01:46:30"},null,{"$f":"penalités!G30","v":""},{"$f":"penalités!H30","v":"00:00:00"},{"$f":"penalités!I30","v":"99:99:99"},{"$f":"penalités!J30","v":""},{"$f":"penalités!K30","v":"00:00:00"},{"$f":"penalités!L30","v":"99:99:99"},{"$f":"penalités!M30","v":"00:00:00"},{"$f":"penalités!N30","v":"00:00:00"},{"$f":"penalités!O30","v":"00:00:00"},{"$f":"penalités!P30","v":"00:00:00"},{"$f":"penalités!Q30","v":"00:00:00"},{"$f":"penalités!R30","v":"00:00:00"},{"$f":"penalités!S30","v":"00:00:00"},{"$f":"penalités!T30","v":"00:00:00"}]
[{"$f":"'TEMPS-ponton'!A31","v":27},{"$f":"'TEMPS-ponton'!B31","v":"MEULAN LES MUREAUX AMMH 1"},{"$f":"'TEMPS-ponton'!C31","v":"AMMH1"},{"$f":"'TEMPS-ponton'!D31","v":"Gwenaelle MARSAIS-Sophie SEFFAR-Catherine MARTINIER-Christelle GOANVIC-Marie LAMORE"},{"$f":"VLOOKUP(A31,Equipes!A:J,2,FALSE)","v":"F"},{"$f":"ROUND(VLOOKUP(A31,Equipes!$A$2:$J$41,10,0),0)","v":47},{"$f":"IF('Temps Pass'!G31>0,'Temps Pass'!G31,\"\")","v":""},{"$f":"IF('Temps Pass'!H31>0,'Temps Pass'!H31,\"\")","v":"00:33:14"},{"$f":"IF('Temps Pass'!I31>0,'Temps Pass'!I31,\"\")","v":"01:00:36"},{"$f":"IF('Temps Pass'!J31>0,'Temps Pass'!J31,\"\")","v":""},{"$f":"IF('Temps Pass'!K31>0,'Temps Pass'!K31,\"\")","v":"01:33:47"},{"$f":"IF('Temps Pass'!L31>0,'Temps Pass'!L31,\"99:99:99\")+T31","v":"01:59:47"},null,{"$f":"penalités!G31","v":""},{"$f":"penalités!H31","v":"00:00:00"},{"$f":"penalités!I31","v":"99:99:99"},{"$f":"penalités!J31","v":""},{"$f":"penalités!K31","v":"00:00:00"},{"$f":"penalités!L31","v":"99:99:99"},{"$f":"penalités!M31","v":"00:00:00"},{"$f":"penalités!N31","v":"00:00:00"},{"$f":"penalités!O31","v":"00:00:00"},{"$f":"penalités!P31","v":"00:00:00"},{"$f":"penalités!Q31","v":"00:00:00"},{"$f":"penalités!R31","v":"00:00:00"},{"$f":"penalités!S31","v":"00:00:00"},{"$f":"penalités!T31","v":"00:00:00"}]
[{"$f":"'TEMPS-ponton'!A32","v":28},{"$f":"'TEMPS-ponton'!B32","v":"VILLENNES - POISSY AC 1"},{"$f":"'TEMPS-ponton'!C32","v":"ACVP1"},{"$f":"'TEMPS-ponton'!D32","v":"Frederic LE ROUX-Corinne HUARD-ROLLAND-Elodie DEREMIENCE-Marie-Claude LAUNAY-Olivier COSNEAU"},{"$f":"VLOOKUP(A32,Equipes!A:J,2,FALSE)","v":"M"},{"$f":"ROUND(VLOOKUP(A32,Equipes!$A$2:$J$41,10,0),0)","v":53},{"$f":"IF('Temps Pass'!G32>0,'Temps Pass'!G32,\"\")","v":""},{"$f":"IF('Temps Pass'!H32>0,'Temps Pass'!H32,\"\")","v":"00:26:14"},{"$f":"IF('Temps Pass'!I32>0,'Temps Pass'!I32,\"\")","v":"00:46:16"},{"$f":"IF('Temps Pass'!J32>0,'Temps Pass'!J32,\"\")","v":""},{"$f":"IF('Temps Pass'!K32>0,'Temps Pass'!K32,\"\")","v":"01:12:03"},{"$f":"IF('Temps Pass'!L32>0,'Temps Pass'!L32,\"99:99:99\")+T32","v":"01:31:07"},null,{"$f":"penalités!G32","v":""},{"$f":"penalités!H32","v":"00:00:00"},{"$f":"penalités!I32","v":"99:99:99"},{"$f":"penalités!J32","v":""},{"$f":"penalités!K32","v":"00:00:00"},{"$f":"penalités!L32","v":"99:99:99"},{"$f":"penalités!M32","v":"00:00:00"},{"$f":"penalités!N32","v":"00:00:00"},{"$f":"penalités!O32","v":"00:00:00"},{"$f":"penalités!P32","v":"00:00:00"},{"$f":"penalités!Q32","v":"00:00:00"},{"$f":"penalités!R32","v":"00:00:00"},{"$f":"penalités!S32","v":"00:00:00"},{"$f":"penalités!T32","v":"00:00:00"}]
[{"$f":"'TEMPS-ponton'!A33","v":29},{"$f":"'TEMPS-ponton'!B33","v":"FONTAINEBLEAU APF 1"},{"$f":"'TEMPS-ponton'!C33","v":"APF1"},{"$f":"'TEMPS-ponton'!D33","v":"Kathleen SANCHEZ-Laurent FOUQUE-Christian MESSALES-Denis FLORY-David WEBER"},{"$f":"VLOOKUP(A33,Equipes!A:J,2,FALSE)","v":"H"},{"$f":"ROUND(VLOOKUP(A33,Equipes!$A$2:$J$41,10,0),0)","v":57},{"$f":"IF('Temps Pass'!G33>0,'Temps Pass'!G33,\"\")","v":""},{"$f":"IF('Temps Pass'!H33>0,'Temps Pass'!H33,\"\")","v":"00:30:14"},{"$f":"IF('Temps Pass'!I33>0,'Temps Pass'!I33,\"\")","v":"00:54:12"},{"$f":"IF('Temps Pass'!J33>0,'Temps Pass'!J33,\"\")","v":""},{"$f":"IF('Temps Pass'!K33>0,'Temps Pass'!K33,\"\")","v":"01:23:29"},{"$f":"IF('Temps Pass'!L33>0,'Temps Pass'!L33,\"99:99:99\")+T33","v":"01:48:05"},null,{"$f":"penalités!G33","v":""},{"$f":"penalités!H33","v":"00:00:00"},{"$f":"penalités!I33","v":"99:99:99"},{"$f":"penalités!J33","v":""},{"$f":"penalités!K33","v":"00:00:00"},{"$f":"penalités!L33","v":"99:99:99"},{"$f":"penalités!M33","v":"00:00:00"},{"$f":"penalités!N33","v":"00:00:00"},{"$f":"penalités!O33","v":"00:00:00"},{"$f":"penalités!P33","v":"00:00:00"},{"$f":"penalités!Q33","v":"00:00:00"},{"$f":"penalités!R33","v":"00:00:00"},{"$f":"penalités!S33","v":"00:00:00"},{"$f":"penalités!T33","v":"00:00:00"}]
[{"$f":"'TEMPS-ponton'!A34","v":30},{"$f":"'TEMPS-ponton'!B34","v":"JOINVILLE AMJ 1"},{"$f":"'TEMPS-ponton'!C34","v":"AMJ1"},{"$f":"'TEMPS-ponton'!D34","v":"Vincent FABIEN-Arnaud PUPPO-Jonathan ROOKE-Xavier SUCHET-Nicolas JAMAULT"},{"$f":"VLOOKUP(A34,Equipes!A:J,2,FALSE)","v":"H"},{"$f":"ROUND(VLOOKUP(A34,Equipes!$A$2:$J$41,10,0),0)","v":51},{"$f":"IF('Temps Pass'!G34>0,'Temps Pass'!G34,\"\")","v":""},{"$f":"IF('Temps Pass'!H34>0,'Temps Pass'!H34,\"\")","v":"00:27:26"},{"$f":"IF('Temps Pass'!I34>0,'Temps Pass'!I34,\"\")","v":"00:48:39"},{"$f":"IF('Temps Pass'!J34>0,'Temps Pass'!J34,\"\")","v":""},{"$f":"IF('Temps Pass'!K34>0,'Temps Pass'!K34,\"\")","v":"01:15:15"},{"$f":"IF('Temps Pass'!L34>0,'Temps Pass'!L34,\"99:99:99\")+T34","v":"01:41:06"},null,{"$f":"penalités!G34","v":""},{"$f":"penalités!H34","v":"00:00:00"},{"$f":"penalités!I34","v":"99:99:99"},{"$f":"penalités!J34","v":""},{"$f":"penalités!K34","v":"00:00:00"},{"$f":"penalités!L34","v":"99:99:99"},{"$f":"penalités!M34","v":"00:05:00"},{"$f":"penalités!N34","v":"00:00:00"},{"$f":"penalités!O34","v":"00:00:00"},{"$f":"penalités!P34","v":"00:00:00"},{"$f":"penalités!Q34","v":"00:05:00"},{"$f":"penalités!R34","v":"00:00:00"},{"$f":"penalités!S34","v":"00:00:00"},{"$f":"penalités!T34","v":"00:00:00"}]
[{"$f":"'TEMPS-ponton'!A35","v":31},{"$f":"'TEMPS-ponton'!B35","v":"NOGENT SUR MARNE CN 3"},{"$f":"'TEMPS-ponton'!C35","v":"CN3"},{"$f":"'TEMPS-ponton'!D35","v":"Alexandra COHEN SALMON-Isabelle MILON-BANNEROT-Jerome TROMBOFSKY-Olivier PASCAL-Elisabeth LAUNAY"},{"$f":"VLOOKUP(A35,Equipes!A:J,2,FALSE)","v":"M"},{"$f":"ROUND(VLOOKUP(A35,Equipes!$A$2:$J$41,10,0),0)","v":53},{"$f":"IF('Temps Pass'!G35>0,'Temps Pass'!G35,\"\")","v":""},{"$f":"IF('Temps Pass'!H35>0,'Temps Pass'!H35,\"\")","v":"00:32:03"},{"$f":"IF('Temps Pass'!I35>0,'Temps Pass'!I35,\"\")","v":"00:56:17"},{"$f":"IF('Temps Pass'!J35>0,'Temps Pass'!J35,\"\")","v":""},{"$f":"IF('Temps Pass'!K35>0,'Temps Pass'!K35,\"\")","v":"01:30:10"},{"$f":"IF('Temps Pass'!L35>0,'Temps Pass'!L35,\"99:99:99\")+T35","v":"01:56:47"},null,{"$f":"penalités!G35","v":""},{"$f":"penalités!H35","v":"00:00:00"},{"$f":"penalités!I35","v":"99:99:99"},{"$f":"penalités!J35","v":""},{"$f":"penalités!K35","v":"00:00:00"},{"$f":"penalités!L35","v":"99:99:99"},{"$f":"penalités!M35","v":"00:00:00"},{"$f":"penalités!N35","v":"00:00:00"},{"$f":"penalités!O35","v":"00:00:00"},{"$f":"penalités!P35","v":"00:00:00"},{"$f":"penalités!Q35","v":"00:00:00"},{"$f":"penalités!R35","v":"00:00:00"},{"$f":"penalités!S35","v":"00:00:00"},{"$f":"penalités!T35","v":"00:00:00"}]
[{"$f":"'TEMPS-ponton'!A36","v":32},{"$f":"'TEMPS-ponton'!B36","v":"BOULOGNE 92 1"},{"$f":"'TEMPS-ponton'!C36","v":"ACBB1"},{"$f":"'TEMPS-ponton'!D36","v":"Isabelle MAIRE-Théo BEL BERBEL- LURBE-Thã‰Odore SEDAROS-Omar OUAZZANI-Alexandra MENEZES"},{"$f":"VLOOKUP(A36,Equipes!A:J,2,FALSE)","v":"H"},{"$f":"ROUND(VLOOKUP(A36,Equipes!$A$2:$J$41,10,0),0)","v":43},{"$f":"IF('Temps Pass'!G36>0,'Temps Pass'!G36,\"\")","v":""},{"$f":"IF('Temps Pass'!H36>0,'Temps Pass'!H36,\"\")","v":""},{"$f":"IF('Temps Pass'!I36>0,'Temps Pass'!I36,\"\")","v":""},{"$f":"IF('Temps Pass'!J36>0,'Temps Pass'!J36,\"\")","v":""},{"$f":"IF('Temps Pass'!K36>0,'Temps Pass'!K36,\"\")","v":""},{"$f":"IF('Temps Pass'!L36>0,'Temps Pass'!L36,\"99:99:99\")","v":"99:99:99"},null,{"$f":"penalités!G36","v":""},{"$f":"penalités!H36","v":"00:00:00"},{"$f":"penalités!I36","v":"99:99:99"},{"$f":"penalités!J36","v":""},{"$f":"penalités!K36","v":"00:00:00"},{"$f":"penalités!L36","v":"99:99:99"},{"$f":"penalités!M36","v":"00:00:00"},{"$f":"penalités!N36","v":"00:00:00"},{"$f":"penalités!O36","v":"00:00:00"},{"$f":"penalités!P36","v":"00:00:00"},{"$f":"penalités!Q36","v":"00:00:00"},{"$f":"penalités!R36","v":"00:00:00"},{"$f":"penalités!S36","v":"00:00:00"},{"$f":"penalités!T36","v":"00:00:00"}]
[{"$f":"'TEMPS-ponton'!A37","v":33},{"$f":"'TEMPS-ponton'!B37","v":"XX"},{"$f":"'TEMPS-ponton'!C37","v":"XX"},{"$f":"'TEMPS-ponton'!D37","v":"XX-XX-XX-XX-XX"},{"$f":"VLOOKUP(A37,Equipes!A:J,2,FALSE)","v":"X"},{"$f":"ROUND(VLOOKUP(A37,Equipes!$A$2:$J$41,10,0),0)","v":0},{"$f":"IF('Temps Pass'!G37>0,'Temps Pass'!G37,\"\")","v":""},{"$f":"IF('Temps Pass'!H37>0,'Temps Pass'!H37,\"\")","v":""},{"$f":"IF('Temps Pass'!I37>0,'Temps Pass'!I37,\"\")","v":""},{"$f":"IF('Temps Pass'!J37>0,'Temps Pass'!J37,\"\")","v":""},{"$f":"IF('Temps Pass'!K37>0,'Temps Pass'!K37,\"\")","v":""},{"$f":"IF('Temps Pass'!L37>0,'Temps Pass'!L37,\"99:99:99\")","v":"99:99:99"},null,{"$f":"penalités!G37","v":""},{"$f":"penalités!H37","v":"00:00:00"},{"$f":"penalités!I37","v":"99:99:99"},{"$f":"penalités!J37","v":""},{"$f":"penalités!K37","v":"00:00:00"},{"$f":"penalités!L37","v":"99:99:99"},{"$f":"penalités!M37","v":"00:00:00"},{"$f":"penalités!N37","v":"00:00:00"},{"$f":"penalités!O37","v":"00:00:00"},{"$f":"penalités!P37","v":"00:00:00"},{"$f":"penalités!Q37","v":"00:00:00"},{"$f":"penalités!R37","v":"00:00:00"},{"$f":"penalités!S37","v":"00:00:00"},{"$f":"penalités!T37","v":"00:00:00"}]
[{"$f":"'TEMPS-ponton'!A38","v":34},{"$f":"'TEMPS-ponton'!B38","v":"XX"},{"$f":"'TEMPS-ponton'!C38","v":"XX"},{"$f":"'TEMPS-ponton'!D38","v":"XX-XX-XX-XX-XX"},{"$f":"VLOOKUP(A38,Equipes!A:J,2,FALSE)","v":"X"},{"$f":"ROUND(VLOOKUP(A38,Equipes!$A$2:$J$41,10,0),0)","v":0},{"$f":"IF('Temps Pass'!G38>0,'Temps Pass'!G38,\"\")","v":""},{"$f":"IF('Temps Pass'!H38>0,'Temps Pass'!H38,\"\")","v":""},{"$f":"IF('Temps Pass'!I38>0,'Temps Pass'!I38,\"\")","v":"00:35:17"},{"$f":"IF('Temps Pass'!J38>0,'Temps Pass'!J38,\"\")","v":""},{"$f":"IF('Temps Pass'!K38>0,'Temps Pass'!K38,\"\")","v":""},{"$f":"IF('Temps Pass'!L38>0,'Temps Pass'!L38,\"99:99:99\")","v":"01:04:57"},null,{"$f":"penalités!G38","v":""},{"$f":"penalités!H38","v":"00:00:00"},{"$f":"penalités!I38","v":"99:99:99"},{"$f":"penalités!J38","v":""},{"$f":"penalités!K38","v":"00:00:00"},{"$f":"penalités!L38","v":"99:99:99"},{"$f":"penalités!M38","v":"00:00:00"},{"$f":"penalités!N38","v":"00:00:00"},{"$f":"penalités!O38","v":"00:00:00"},{"$f":"penalités!P38","v":"00:00:00"},{"$f":"penalités!Q38","v":"00:00:00"},{"$f":"penalités!R38","v":"00:00:00"},{"$f":"penalités!S38","v":"00:00:00"},{"$f":"penalités!T38","v":"00:00:00"}]
[{"$f":"'TEMPS-ponton'!A39","v":35},{"$f":"'TEMPS-ponton'!B39","v":"XX"},{"$f":"'TEMPS-ponton'!C39","v":"XX"},{"$f":"'TEMPS-ponton'!D39","v":"XX-XX-XX-XX-XX"},{"$f":"VLOOKUP(A39,Equipes!A:J,2,FALSE)","v":"X"},{"$f":"ROUND(VLOOKUP(A39,Equipes!$A$2:$J$41,10,0),0)","v":0},{"$f":"IF('Temps Pass'!G39>0,'Temps Pass'!G39,\"\")","v":""},{"$f":"IF('Temps Pass'!H39>0,'Temps Pass'!H39,\"\")","v":""},{"$f":"IF('Temps Pass'!I39>0,'Temps Pass'!I39,\"\")","v":""},{"$f":"IF('Temps Pass'!J39>0,'Temps Pass'!J39,\"\")","v":""},{"$f":"IF('Temps Pass'!K39>0,'Temps Pass'!K39,\"\")","v":""},{"$f":"IF('Temps Pass'!L39>0,'Temps Pass'!L39,\"99:99:99\")","v":"99:99:99"},null,{"$f":"penalités!G39","v":""},{"$f":"penalités!H39","v":"00:00:00"},{"$f":"penalités!I39","v":"99:99:99"},{"$f":"penalités!J39","v":""},{"$f":"penalités!K39","v":"00:00:00"},{"$f":"penalités!L39","v":"99:99:99"},{"$f":"penalités!M39","v":"00:00:00"},{"$f":"penalités!N39","v":"00:00:00"},{"$f":"penalités!O39","v":"00:00:00"},{"$f":"penalités!P39","v":"00:00:00"},{"$f":"penalités!Q39","v":"00:00:00"},{"$f":"penalités!R39","v":"00:00:00"},{"$f":"penalités!S39","v":"00:00:00"},{"$f":"penalités!T39","v":"00:00:00"}]
[{"$f":"'TEMPS-ponton'!A40","v":36},{"$f":"'TEMPS-ponton'!B40","v":"XX"},{"$f":"'TEMPS-ponton'!C40","v":"XX"},{"$f":"'TEMPS-ponton'!D40","v":"XX-XX-XX-XX-XX"},{"$f":"VLOOKUP(A40,Equipes!A:J,2,FALSE)","v":"X"},{"$f":"ROUND(VLOOKUP(A40,Equipes!$A$2:$J$41,10,0),0)","v":0},{"$f":"IF('Temps Pass'!G40>0,'Temps Pass'!G40,\"\")","v":""},{"$f":"IF('Temps Pass'!H40>0,'Temps Pass'!H40,\"\")","v":""},{"$f":"IF('Temps Pass'!I40>0,'Temps Pass'!I40,\"\")","v":""},{"$f":"IF('Temps Pass'!J40>0,'Temps Pass'!J40,\"\")","v":""},{"$f":"IF('Temps Pass'!K40>0,'Temps Pass'!K40,\"\")","v":""},{"$f":"IF('Temps Pass'!L40>0,'Temps Pass'!L40,\"99:99:99\")","v":"99:99:99"},null,{"$f":"penalités!G40","v":""},{"$f":"penalités!H40","v":"00:00:00"},{"$f":"penalités!I40","v":"99:99:99"},{"$f":"penalités!J40","v":""},{"$f":"penalités!K40","v":"00:00:00"},{"$f":"penalités!L40","v":"99:99:99"},{"$f":"penalités!M40","v":"00:00:00"},{"$f":"penalités!N40","v":"00:00:00"},{"$f":"penalités!O40","v":"00:00:00"},{"$f":"penalités!P40","v":"00:00:00"},{"$f":"penalités!Q40","v":"00:00:00"},{"$f":"penalités!R40","v":"00:00:00"},{"$f":"penalités!S40","v":"00:00:00"},{"$f":"penalités!T40","v":"00:00:00"}]
[{"$f":"'TEMPS-ponton'!A41","v":37},{"$f":"'TEMPS-ponton'!B41","v":"XX"},{"$f":"'TEMPS-ponton'!C41","v":"XX"},{"$f":"'TEMPS-ponton'!D41","v":"XX-XX-XX-XX-XX"},{"$f":"VLOOKUP(A41,Equipes!A:J,2,FALSE)","v":"X"},{"$f":"ROUND(VLOOKUP(A41,Equipes!$A$2:$J$41,10,0),0)","v":0},{"$f":"IF('Temps Pass'!G41>0,'Temps Pass'!G41,\"\")","v":""},{"$f":"IF('Temps Pass'!H41>0,'Temps Pass'!H41,\"\")","v":""},{"$f":"IF('Temps Pass'!I41>0,'Temps Pass'!I41,\"\")","v":""},{"$f":"IF('Temps Pass'!J41>0,'Temps Pass'!J41,\"\")","v":""},{"$f":"IF('Temps Pass'!K41>0,'Temps Pass'!K41,\"\")","v":""},{"$f":"IF('Temps Pass'!L41>0,'Temps Pass'!L41,\"99:99:99\")","v":"99:99:99"},null,{"$f":"penalités!G41","v":""},{"$f":"penalités!H41","v":"00:00:00"},{"$f":"penalités!I41","v":"99:99:99"},{"$f":"penalités!J41","v":""},{"$f":"penalités!K41","v":"00:00:00"},{"$f":"penalités!L41","v":"99:99:99"},{"$f":"penalités!M41","v":"00:00:00"},{"$f":"penalités!N41","v":"00:00:00"},{"$f":"penalités!O41","v":"00:00:00"},{"$f":"penalités!P41","v":"00:00:00"},{"$f":"penalités!Q41","v":"00:00:00"},{"$f":"penalités!R41","v":"00:00:00"},{"$f":"penalités!S41","v":"00:00:00"},{"$f":"penalités!T41","v":"00:00:00"}]
[{"$f":"'TEMPS-ponton'!A42","v":38},{"$f":"'TEMPS-ponton'!B42","v":"XX"},{"$f":"'TEMPS-ponton'!C42","v":"XX"},{"$f":"'TEMPS-ponton'!D42","v":"XX-XX-XX-XX-XX"},{"$f":"VLOOKUP(A42,Equipes!A:J,2,FALSE)","v":"X"},{"$f":"ROUND(VLOOKUP(A42,Equipes!$A$2:$J$41,10,0),0)","v":0},{"$f":"IF('Temps Pass'!G42>0,'Temps Pass'!G42,\"\")","v":""},{"$f":"IF('Temps Pass'!H42>0,'Temps Pass'!H42,\"\")","v":""},{"$f":"IF('Temps Pass'!I42>0,'Temps Pass'!I42,\"\")","v":""},{"$f":"IF('Temps Pass'!J42>0,'Temps Pass'!J42,\"\")","v":""},{"$f":"IF('Temps Pass'!K42>0,'Temps Pass'!K42,\"\")","v":""},{"$f":"IF('Temps Pass'!L42>0,'Temps Pass'!L42,\"99:99:99\")","v":"99:99:99"},null,{"$f":"penalités!G42","v":""},{"$f":"penalités!H42","v":"00:00:00"},{"$f":"penalités!I42","v":"99:99:99"},{"$f":"penalités!J42","v":""},{"$f":"penalités!K42","v":"00:00:00"},{"$f":"penalités!L42","v":"99:99:99"},{"$f":"penalités!M42","v":"00:00:00"},{"$f":"penalités!N42","v":"00:00:00"},{"$f":"penalités!O42","v":"00:00:00"},{"$f":"penalités!P42","v":"00:00:00"},{"$f":"penalités!Q42","v":"00:00:00"},{"$f":"penalités!R42","v":"00:00:00"},{"$f":"penalités!S42","v":"00:00:00"},{"$f":"penalités!T42","v":"00:00:00"}]
[{"$f":"'TEMPS-ponton'!A43","v":39},{"$f":"'TEMPS-ponton'!B43","v":"XX"},{"$f":"'TEMPS-ponton'!C43","v":"XX"},{"$f":"'TEMPS-ponton'!D43","v":"XX-XX-XX-XX-XX"},{"$f":"VLOOKUP(A43,Equipes!A:J,2,FALSE)","v":"X"},{"$f":"ROUND(VLOOKUP(A43,Equipes!$A$2:$J$41,10,0),0)","v":0},{"$f":"IF('Temps Pass'!G43>0,'Temps Pass'!G43,\"\")","v":""},{"$f":"IF('Temps Pass'!H43>0,'Temps Pass'!H43,\"\")","v":""},{"$f":"IF('Temps Pass'!I43>0,'Temps Pass'!I43,\"\")","v":""},{"$f":"IF('Temps Pass'!J43>0,'Temps Pass'!J43,\"\")","v":""},{"$f":"IF('Temps Pass'!K43>0,'Temps Pass'!K43,\"\")","v":""},{"$f":"IF('Temps Pass'!L43>0,'Temps Pass'!L43,\"99:99:99\")","v":"99:99:99"},null,{"$f":"penalités!G43","v":""},{"$f":"penalités!H43","v":"00:00:00"},{"$f":"penalités!I43","v":"99:99:99"},{"$f":"penalités!J43","v":""},{"$f":"penalités!K43","v":"00:00:00"},{"$f":"penalités!L43","v":"99:99:99"},{"$f":"penalités!M43","v":"00:00:00"},{"$f":"penalités!N43","v":"00:00:00"},{"$f":"penalités!O43","v":"00:00:00"},{"$f":"penalités!P43","v":"00:00:00"},{"$f":"penalités!Q43","v":"00:00:00"},{"$f":"penalités!R43","v":"00:00:00"},{"$f":"penalités!S43","v":"00:00:00"},{"$f":"penalités!T43","v":"00:00:00"}]
[{"$f":"'TEMPS-ponton'!A44","v":40},{"$f":"'TEMPS-ponton'!B44","v":"XX"},{"$f":"'TEMPS-ponton'!C44","v":"XX"},{"$f":"'TEMPS-ponton'!D44","v":"XX-XX-XX-XX-XX"},{"$f":"VLOOKUP(A44,Equipes!A:J,2,FALSE)","v":"X"},{"$f":"ROUND(VLOOKUP(A44,Equipes!$A$2:$J$41,10,0),0)","v":0},{"$f":"IF('Temps Pass'!G44>0,'Temps Pass'!G44,\"\")","v":""},{"$f":"IF('Temps Pass'!H44>0,'Temps Pass'!H44,\"\")","v":""},{"$f":"IF('Temps Pass'!I44>0,'Temps Pass'!I44,\"\")","v":""},{"$f":"IF('Temps Pass'!J44>0,'Temps Pass'!J44,\"\")","v":""},{"$f":"IF('Temps Pass'!K44>0,'Temps Pass'!K44,\"\")","v":""},{"$f":"IF('Temps Pass'!L44>0,'Temps Pass'!L44,\"99:99:99\")","v":"99:99:99"},null,{"$f":"penalités!G44","v":""},{"$f":"penalités!H44","v":"00:00:00"},{"$f":"penalités!I44","v":"99:99:99"},{"$f":"penalités!J44","v":""},{"$f":"penalités!K44","v":"00:00:00"},{"$f":"penalités!L44","v":"99:99:99"},{"$f":"penalités!M44","v":"00:00:00"},{"$f":"penalités!N44","v":"00:00:00"},{"$f":"penalités!O44","v":"00:00:00"},{"$f":"penalités!P44","v":"00:00:00"},{"$f":"penalités!Q44","v":"00:00:00"},{"$f":"penalités!R44","v":"00:00:00"},{"$f":"penalités!S44","v":"00:00:00"},{"$f":"penalités!T44","v":"00:00:00"}]

{"sheet":"Ecart Record","index":18,"n_rows":44,"n_cols":10,"rows_kept":44,"cut":false,"hidden":false,"merged":[[0,0,1,2],[0,3,1,5],[0,6,1,9]]}
["GRAND 8 ",null,null,{"$f":"'Note explicative fichier'!E3","v":"2024-06-02"}]
[]
["Yolette N°","Club","Ville","Equipage ","Cat.","Age Moy.","1 / 4\nG-8","1 / 2\nG-8","3 / 4\nG-8","Arrivée"]
[{"$f":"'Temps corr'!A4","v":"Record"},{"$f":"'Temps corr'!B4","v":"POLYTECHNIQUE ( Référence 2012 )"},{"$f":"'Temps corr'!C4","v":"Palaiseau"},{"$f":"'Temps corr'!D4","v":"FERRERO Michel - Alexandre Rosinski - BOYAUD Mathieu - GODDE Olivier - THECKES Benoit"},null,null,{"$f":"'Temps corr'!H4","v":"00:23:35"},{"$f":"'Temps corr'!I4","v":"00:40:41"},{"$f":"'Temps corr'!K4","v":"01:04:34"},{"$f":"'Temps corr'!L4","v":"01:21:48"}]
[{"$f":"'Temps corr'!A5","v":1},{"$f":"'Temps corr'!B5","v":"ANDRESY CA CONFLUENT 1"},{"$f":"'Temps corr'!C5","v":"Cac1"},{"$f":"'Temps corr'!D5","v":"Stephanie LAPORTE-Marine NACERI-Marc LACCASSAGNE-Stephane ZETTWOOG-Fouzia VOIRIN"},{"$f":"VLOOKUP(A5,Equipes!A:J,2,FALSE)","v":"M"},{"$f":"ROUND(VLOOKUP(A5,Equipes!$A$2:$J$41,10,0),0)","v":49},{"$f":"'Temps corr'!H5-'Temps corr'!H$4","v":"00:09:45"},{"$f":"'Temps corr'!I5-'Temps corr'!I$4","v":"00:17:16"},{"$f":"'Temps corr'!K5-'Temps corr'!K$4","v":"00:23:12"},{"$f":"'Temps corr'!L5-'Temps corr'!L$4","v":"00:35:05"}]
[{"$f":"'Temps corr'!A6","v":2},{"$f":"'Temps corr'!B6","v":"CAUDEBEC EN CAUX ACVS 1"},{"$f":"'Temps corr'!C6","v":"Caudebec"},{"$f":"'Temps corr'!D6","v":"Martine NARBAIS-JAUREGUY-Caroline KERVRANN-Stephane DELAMARE-Nicolas BARRAY-Francois NARBAIS-JAUREGUY"},{"$f":"VLOOKUP(A6,Equipes!A:J,2,FALSE)","v":"M"},{"$f":"ROUND(VLOOKUP(A6,Equipes!$A$2:$J$41,10,0),0)","v":55},{"$f":"'Temps corr'!H6-'Temps corr'!H$4","v":"00:06:33"},{"$f":"'Temps corr'!I6-'Temps corr'!I$4","v":"00:11:41"},{"$f":"'Temps corr'!K6-'Temps corr'!K$4","v":"00:16:56"},{"$f":"'Temps corr'!L6-'Temps corr'!L$4","v":"00:21:59"}]
[{"$f":"'Temps corr'!A7","v":3},{"$f":"'Temps corr'!B7","v":"ANDRESY CA CONFLUENT 2"},{"$f":"'Temps corr'!C7","v":"CAC 2"},{"$f":"'Temps corr'!D7","v":"Anna ALCALOIDEPOIXBLANC-Geoffrey GHIZZONI-Nathalie BOURGEOIS-Franck CHRISTIANNOT-NicOLAS delaunoy"},{"$f":"VLOOKUP(A7,Equipes!A:J,2,FALSE)","v":"M"},{"$f":"ROUND(VLOOKUP(A7,Equipes!$A$2:$J$41,10,0),0)","v":55},{"$f":"'Temps corr'!H7-'Temps corr'!H$4","v":"00:10:13"},{"$f":"'Temps corr'!I7-'Temps corr'!I$4","v":"00:20:08"},{"$f":"'Temps corr'!K7-'Temps corr'!K$4","v":"00:27:39"},{"$f":"'Temps corr'!L7-'Temps corr'!L$4","v":"00:36:01"}]
[{"$f":"'Temps corr'!A8","v":4},{"$f":"'Temps corr'!B8","v":"ANDRESY CA CONFLUENT 1"},{"$f":"'Temps corr'!C8","v":"CAC3"},{"$f":"'Temps corr'!D8","v":"Emmanuel SALIN-Ousseni PARKOUDA-Jean-Baptiste PROVENZANO-Jerome CLAVE-Julian GALLELA"},{"$f":"VLOOKUP(A8,Equipes!A:J,2,FALSE)","v":"H"},{"$f":"ROUND(VLOOKUP(A8,Equipes!$A$2:$J$41,10,0),0)","v":46},{"$f":"'Temps corr'!H8-'Temps corr'!H$4","v":"00:06:10"},{"$f":"'Temps corr'!I8-'Temps corr'!I$4","v":"00:13:07"},{"$f":"'Temps corr'!K8-'Temps corr'!K$4","v":"00:18:12"},{"$f":"'Temps corr'!L8-'Temps corr'!L$4","v":"00:25:39"}]
[{"$f":"'Temps corr'!A9","v":5},{"$f":"'Temps corr'!B9","v":"PORT-MARLY RC 1"},{"$f":"'Temps corr'!C9","v":"RCPM"},{"$f":"'Temps corr'!D9","v":"Claudie BODIN-Fanny LAMOUR-Etienne DUPUIS-Jeancharles FAUCHEUX-Gildas KETTANJIAN"},{"$f":"VLOOKUP(A9,Equipes!A:J,2,FALSE)","v":"M"},{"$f":"ROUND(VLOOKUP(A9,Equipes!$A$2:$J$41,10,0),0)","v":50},{"$f":"'Temps corr'!H9-'Temps corr'!H$4","v":"00:06:53"},{"$f":"'Temps corr'!I9-'Temps corr'!I$4","v":"00:13:53"},{"$f":"'Temps corr'!K9-'Temps corr'!K$4","v":"00:20:24"},{"$f":"'Temps corr'!L9-'Temps corr'!L$4","v":"00:27:24"}]
[{"$f":"'Temps corr'!A10","v":6},{"$f":"'Temps corr'!B10","v":"BOULOGNE 92 2"},{"$f":"'Temps corr'!C10","v":"ACBB"},{"$f":"'Temps corr'!D10","v":"CéLia ROUSSELLE-Marie Pierre MARSALLON GAMBY-Françis ROBIN-Nicolas LECOEUR-Theodora XENOGIANI"},{"$f":"VLOOKUP(A10,Equipes!A:J,2,FALSE)","v":"M"},{"$f":"ROUND(VLOOKUP(A10,Equipes!$A$2:$J$41,10,0),0)","v":46},{"$f":"'Temps corr'!H10-'Temps corr'!H$4","v":"00:04:54"},{"$f":"'Temps corr'!I10-'Temps corr'!I$4","v":"00:10:00"},{"$f":"'Temps corr'!K10-'Temps corr'!K$4","v":"00:13:53"},{"$f":"'Temps corr'!L10-'Temps corr'!L$4","v":"00:17:55"}]
[{"$f":"'Temps corr'!A11","v":7},{"$f":"'Temps corr'!B11","v":"VILLENNES - POISSY AC 3"},{"$f":"'Temps corr'!C11","v":"ACVP"},{"$f":"'Temps corr'!D11","v":"Virginie ALEXANDRE-Jihad LEMARQRI-Cyrille BRUZON-BASCOU-Sebastien CARPENTIER-Marie Estelle D'ARBAUMONT"},{"$f":"VLOOKUP(A11,Equipes!A:J,2,FALSE)","v":"M"},{"$f":"ROUND(VLOOKUP(A11,Equipes!$A$2:$J$41,10,0),0)","v":49},{"$f":"'Temps corr'!H11-'Temps corr'!H$4","v":"00:05:10"},{"$f":"'Temps corr'!I11-'Temps corr'!I$4","v":"00:10:46"},{"$f":"'Temps corr'!K11-'Temps corr'!K$4","v":"00:14:46"},{"$f":"'Temps corr'!L11-'Temps corr'!L$4","v":"00:19:41"}]
[{"$f":"'Temps corr'!A12","v":8},{"$f":"'Temps corr'!B12","v":"JOINVILLE AMJ 1"},{"$f":"'Temps corr'!C12","v":"Joinville"},{"$f":"'Temps corr'!D12","v":"Laurent BAUDOIN-Raphaelle BOUVIER FLORY-Sophie BUSTOS-Kastriot JAKA-Thomas AUGER"},{"$f":"VLOOKUP(A12,Equipes!A:J,2,FALSE)","v":"M"},{"$f":"ROUND(VLOOKUP(A12,Equipes!$A$2:$J$41,10,0),0)","v":46},{"$f":"'Temps corr'!H12-'Temps corr'!H$4","v":"00:04:00"},{"$f":"'Temps corr'!I12-'Temps corr'!I$4","v":"00:07:24"},{"$f":"'Temps corr'!K12-'Temps corr'!K$4","v":"00:09:09"},{"$f":"'Temps corr'!L12-'Temps corr'!L$4","v":"00:11:44"}]
[{"$f":"'Temps corr'!A13","v":9},{"$f":"'Temps corr'!B13","v":"NOGENT SUR MARNE CN 1"},{"$f":"'Temps corr'!C13","v":"CN 1"},{"$f":"'Temps corr'!D13","v":"Chrystelle SUPIOT-Caroline PIEDNOIRE-Olivier MUCIGNAT-Andre SIMONNET-Fabienne LORTIE"},{"$f":"VLOOKUP(A13,Equipes!A:J,2,FALSE)","v":"M"},{"$f":"ROUND(VLOOKUP(A13,Equipes!$A$2:$J$41,10,0),0)","v":53},{"$f":"'Temps corr'!H13-'Temps corr'!H$4","v":"00:05:13"},{"$f":"'Temps corr'!I13-'Temps corr'!I$4","v":"00:09:41"},{"$f":"'Temps corr'!K13-'Temps corr'!K$4","v":"00:15:05"},{"$f":"'Temps corr'!L13-'Temps corr'!L$4","v":"00:21:48"}]
[{"$f":"'Temps corr'!A14","v":10},{"$f":"'Temps corr'!B14","v":"NOGENT SUR MARNE CN 2"},{"$f":"'Temps corr'!C14","v":"CN2"},{"$f":"'Temps corr'!D14","v":"Christophe RUCKEBUSCH-Nicolas BURCKHART-Alice GHEERBRANT-Aurelie DONVAL-Gerard LECA"},{"$f":"VLOOKUP(A14,Equipes!A:J,2,FALSE)","v":"M"},{"$f":"ROUND(VLOOKUP(A14,Equipes!$A$2:$J$41,10,0),0)","v":53},{"$f":"'Temps corr'!H14-'Temps corr'!H$4","v":"00:03:39"},{"$f":"'Temps corr'!I14-'Temps corr'!I$4","v":"00:07:04"},{"$f":"'Temps corr'!K14-'Temps corr'!K$4","v":"00:10:52"},{"$f":"'Temps corr'!L14-'Temps corr'!L$4","v":"00:15:06"}]
[{"$f":"'Temps corr'!A15","v":11},{"$f":"'Temps corr'!B15","v":"BOULOGNE 92 1"},{"$f":"'Temps corr'!C15","v":"ACBB"},{"$f":"'Temps corr'!D15","v":"Viviane BALLOY-Timothé BAZIRIES-Alexandre LE FUR-Sigrid PABST-Michel VEDRINE"},{"$f":"VLOOKUP(A15,Equipes!A:J,2,FALSE)","v":"H"},{"$f":"ROUND(VLOOKUP(A15,Equipes!$A$2:$J$41,10,0),0)","v":51},{"$f":"'Temps corr'!H15-'Temps corr'!H$4","v":"00:06:32"},{"$f":"'Temps corr'!I15-'Temps corr'!I$4","v":"00:13:59"},{"$f":"'Temps corr'!K15-'Temps corr'!K$4","v":-2.684027777777781E-2},{"$f":"'Temps corr'!L15-'Temps corr'!L$4","v":"00:29:07"}]
[{"$f":"'Temps corr'!A16","v":12},{"$f":"'Temps corr'!B16","v":"EVRY SCA 2"},{"$f":"'Temps corr'!C16","v":"SCA2"},{"$f":"'Temps corr'!D16","v":"Laurent YEBOAH-Isabelle MOISSET FLEURISSON-Frederic DUCAUQUY-Sandrine GARCIA-Christelle MARTIN"},{"$f":"VLOOKUP(A16,Equipes!A:J,2,FALSE)","v":"M"},{"$f":"ROUND(VLOOKUP(A16,Equipes!$A$2:$J$41,10,0),0)","v":48},{"$f":"'Temps corr'!H16-'Temps corr'!H$4","v":"00:02:39"},{"$f":"'Temps corr'!I16-'Temps corr'!I$4","v":"00:05:42"},{"$f":"'Temps corr'!K16-'Temps corr'!K$4","v":"00:07:41"},{"$f":"'Temps corr'!L16-'Temps corr'!L$4","v":"00:15:05"}]
[{"$f":"'Temps corr'!A17","v":13},{"$f":"'Temps corr'!B17","v":"PORT-MARLY RC 2"},{"$f":"'Temps corr'!C17","v":"RCPM2"},{"$f":"'Temps corr'!D17","v":"Elsa CROZATIER-Cyrielle BERTHIER-Hervé Valette-Eric MOINARD-Anais FEUGA"},{"$f":"VLOOKUP(A17,Equipes!A:J,2,FALSE)","v":"M"},{"$f":"ROUND(VLOOKUP(A17,Equipes!$A$2:$J$41,10,0),0)","v":47},{"$f":"'Temps corr'!H17-'Temps corr'!H$4","v":"00:01:59"},{"$f":"'Temps corr'!I17-'Temps corr'!I$4","v":"00:05:04"},{"$f":"'Temps corr'!K17-'Temps corr'!K$4","v":"00:06:41"},{"$f":"'Temps corr'!L17-'Temps corr'!L$4","v":"00:15:11"}]
[{"$f":"'Temps corr'!A18","v":14},{"$f":"'Temps corr'!B18","v":"MAISONS MESNIL CERAMM 1"},{"$f":"'Temps corr'!C18","v":"CERAMM1"},{"$f":"'Temps corr'!D18","v":"Nicolas SCHMITT-Gloria VENDRELL-Christine MARIE LAVAUD-Amaury DE LA LAURENCIE-Amina ELABBADI"},{"$f":"VLOOKUP(A18,Equipes!A:J,2,FALSE)","v":"M"},{"$f":"ROUND(VLOOKUP(A18,Equipes!$A$2:$J$41,10,0),0)","v":50},{"$f":"'Temps corr'!H18-'Temps corr'!H$4","v":"00:04:53"},{"$f":"'Temps corr'!I18-'Temps corr'!I$4","v":"00:09:11"},{"$f":"'Temps corr'!K18-'Temps corr'!K$4","v":"00:14:41"},{"$f":"'Temps corr'!L18-'Temps corr'!L$4","v":"00:20:27"}]
[{"$f":"'Temps corr'!A19","v":15},{"$f":"'Temps corr'!B19","v":"SOISY SUR SEINE CN 1"},{"$f":"'Temps corr'!C19","v":"CN1"},{"$f":"'Temps corr'!D19","v":"Bertrand PIOGER-Bruno PERIQUOI-Servane BERTRAND-Alain BERNARD-Robert TRAUET"},{"$f":"VLOOKUP(A19,Equipes!A:J,2,FALSE)","v":"H"},{"$f":"ROUND(VLOOKUP(A19,Equipes!$A$2:$J$41,10,0),0)","v":54},{"$f":"'Temps corr'!H19-'Temps corr'!H$4","v":"00:03:50"},{"$f":"'Temps corr'!I19-'Temps corr'!I$4","v":"00:06:26"},{"$f":"'Temps corr'!K19-'Temps corr'!K$4","v":"00:08:17"},{"$f":"'Temps corr'!L19-'Temps corr'!L$4","v":"00:17:20"}]
[{"$f":"'Temps corr'!A20","v":16},{"$f":"'Temps corr'!B20","v":"PORT-MARLY RC 1"},{"$f":"'Temps corr'!C20","v":"RCPM1"},{"$f":"'Temps corr'!D20","v":"Jean-Claude LAFOREST-David CHARTIER-Christophe MARCAIS-Vincent BONTOUX-Alain ROUSSEAU"},{"$f":"VLOOKUP(A20,Equipes!A:J,2,FALSE)","v":"H"},{"$f":"ROUND(VLOOKUP(A20,Equipes!$A$2:$J$41,10,0),0)","v":55},{"$f":"'Temps corr'!H20-'Temps corr'!H$4","v":"00:01:31"},{"$f":"'Temps corr'!I20-'Temps corr'!I$4","v":"00:03:15"},{"$f":"'Temps corr'!K20-'Temps corr'!K$4","v":"00:02:30"},{"$f":"'Temps corr'!L20-'Temps corr'!L$4","v":"00:08:37"}]
[{"$f":"'Temps corr'!A21","v":17},{"$f":"'Temps corr'!B21","v":"ANDRESY CA CONFLUENT 1"},{"$f":"'Temps corr'!C21","v":"CAC1"},{"$f":"'Temps corr'!D21","v":"Daphne PARIZOT-Agnes BURGHGRAEVE SELLEN-Sylvie FRANSSEN-Severine LEGAILLARD-Martine LE ROUX"},{"$f":"VLOOKUP(A21,Equipes!A:J,2,FALSE)","v":"F"},{"$f":"ROUND(VLOOKUP(A21,Equipes!$A$2:$J$41,10,0),0)","v":55},{"$f":"'Temps corr'!H21-'Temps corr'!H$4","v":"00:10:23"},{"$f":"'Temps corr'!I21-'Temps corr'!I$4","v":"00:18:59"},{"$f":"'Temps corr'!K21-'Temps corr'!K$4","v":"00:29:27"},{"$f":"'Temps corr'!L21-'Temps corr'!L$4","v":"00:39:22"}]
[{"$f":"'Temps corr'!A22","v":18},{"$f":"'Temps corr'!B22","v":"MAISONS MESNIL CERAMM 2"},{"$f":"'Temps corr'!C22","v":"CERAMM2"},{"$f":"'Temps corr'!D22","v":"Claude LEMENAGER-Didier GIRARDEAU-Laurent LIBOTTE-Alain GIRARD-Cecile JEAMMES"},{"$f":"VLOOKUP(A22,Equipes!A:J,2,FALSE)","v":"H"},{"$f":"ROUND(VLOOKUP(A22,Equipes!$A$2:$J$41,10,0),0)","v":58},{"$f":"'Temps corr'!H22-'Temps corr'!H$4","v":"00:05:15"},{"$f":"'Temps corr'!I22-'Temps corr'!I$4","v":"00:10:28"},{"$f":"'Temps corr'!K22-'Temps corr'!K$4","v":"00:14:57"},{"$f":"'Temps corr'!L22-'Temps corr'!L$4","v":"00:19:50"}]
[{"$f":"'Temps corr'!A23","v":19},{"$f":"'Temps corr'!B23","v":"VILLENNES - POISSY AC 1"},{"$f":"'Temps corr'!C23","v":"ACVP1"},{"$f":"'Temps corr'!D23","v":"Olivier POLGE-Odile POLGE-Laurent BONHOMMET-Antoine VOLPI-Philippe STROHM"},{"$f":"VLOOKUP(A23,Equipes!A:J,2,FALSE)","v":"H"},{"$f":"ROUND(VLOOKUP(A23,Equipes!$A$2:$J$41,10,0),0)","v":55},{"$f":"'Temps corr'!H23-'Temps corr'!H$4","v":"00:06:21"},{"$f":"'Temps corr'!I23-'Temps corr'!I$4","v":"00:11:21"},{"$f":"'Temps corr'!K23-'Temps corr'!K$4","v":"00:15:13"},{"$f":"'Temps corr'!L23-'Temps corr'!L$4","v":"00:19:08"}]
[{"$f":"'Temps corr'!A24","v":20},{"$f":"'Temps corr'!B24","v":"ROUEN CNAR 1"},{"$f":"'Temps corr'!C24","v":"CNAR1"},{"$f":"'Temps corr'!D24","v":"Nathalie MOUSSET-Francois LAIR-Betty GESLAIN-Thierry DUCHESNE-Stephane MOUSSET"},{"$f":"VLOOKUP(A24,Equipes!A:J,2,FALSE)","v":"M"},{"$f":"ROUND(VLOOKUP(A24,Equipes!$A$2:$J$41,10,0),0)","v":55},{"$f":"'Temps corr'!H24-'Temps corr'!H$4","v":"00:05:18"},{"$f":"'Temps corr'!I24-'Temps corr'!I$4","v":"00:10:00"},{"$f":"'Temps corr'!K24-'Temps corr'!K$4","v":"00:12:36"},{"$f":"'Temps corr'!L24-'Temps corr'!L$4","v":"00:15:25"}]
[{"$f":"'Temps corr'!A25","v":21},{"$f":"'Temps corr'!B25","v":"PORT-MARLY RC 2"},{"$f":"'Temps corr'!C25","v":"RCPM2"},{"$f":"'Temps corr'!D25","v":"Guillaume CHARRON-Philippe VERHE-Stephan REYNIER-Dominique LEROUX-Luciano AUTUNNALE"},{"$f":"VLOOKUP(A25,Equipes!A:J,2,FALSE)","v":"H"},{"$f":"ROUND(VLOOKUP(A25,Equipes!$A$2:$J$41,10,0),0)","v":51},{"$f":"'Temps corr'!H25-'Temps corr'!H$4","v":"00:01:53"},{"$f":"'Temps corr'!I25-'Temps corr'!I$4","v":"00:05:23"},{"$f":"'Temps corr'!K25-'Temps corr'!K$4","v":"00:07:09"},{"$f":"'Temps corr'!L25-'Temps corr'!L$4","v":"00:09:52"}]
[{"$f":"'Temps corr'!A26","v":22},{"$f":"'Temps corr'!B26","v":"COUDRAY MONTCEAUX A 1"},{"$f":"'Temps corr'!C26","v":"coudray1"},{"$f":"'Temps corr'!D26","v":"Joseph RAYNAUD-Frederic MORAT-Benjamin HOUILLON-Pascal BEAUSSART-Anne HOUAL"},{"$f":"VLOOKUP(A26,Equipes!A:J,2,FALSE)","v":"H"},{"$f":"ROUND(VLOOKUP(A26,Equipes!$A$2:$J$41,10,0),0)","v":52},{"$f":"'Temps corr'!H26-'Temps corr'!H$4","v":"00:05:35"},{"$f":"'Temps corr'!I26-'Temps corr'!I$4","v":"00:10:59"},{"$f":"'Temps corr'!K26-'Temps corr'!K$4","v":"00:15:09"},{"$f":"'Temps corr'!L26-'Temps corr'!L$4","v":"00:19:58"}]
[{"$f":"'Temps corr'!A27","v":23},{"$f":"'Temps corr'!B27","v":"SN OISE 1"},{"$f":"'Temps corr'!C27","v":"SN Oise 1\n"},{"$f":"'Temps corr'!D27","v":"Agnes AUDEBERT-Nicolas RAUCH-Jerome ROUGE-Nathalie BAUDIER-Isabelle JOUBERT"},{"$f":"VLOOKUP(A27,Equipes!A:J,2,FALSE)","v":"M"},{"$f":"ROUND(VLOOKUP(A27,Equipes!$A$2:$J$41,10,0),0)","v":50},{"$f":"'Temps corr'!H27-'Temps corr'!H$4","v":"00:07:49"},{"$f":"'Temps corr'!I27-'Temps corr'!I$4","v":"00:15:51"},{"$f":"'Temps corr'!K27-'Temps corr'!K$4","v":"00:23:32"},{"$f":"'Temps corr'!L27-'Temps corr'!L$4","v":"00:31:14"}]
[{"$f":"'Temps corr'!A28","v":24},{"$f":"'Temps corr'!B28","v":"MEULAN LES MUREAUX AMMH 1"},{"$f":"'Temps corr'!C28","v":"AMMH1"},{"$f":"'Temps corr'!D28","v":"Xavier MARSAIS-Eric PRENEY-Yannick DAGMEY-David COINE-Arthur VAN SLOOTEN"},{"$f":"VLOOKUP(A28,Equipes!A:J,2,FALSE)","v":"H"},{"$f":"ROUND(VLOOKUP(A28,Equipes!$A$2:$J$41,10,0),0)","v":53},{"$f":"'Temps corr'!H28-'Temps corr'!H$4","v":"00:03:08"},{"$f":"'Temps corr'!I28-'Temps corr'!I$4","v":"00:07:18"},{"$f":"'Temps corr'!K28-'Temps corr'!K$4","v":"00:11:25"},{"$f":"'Temps corr'!L28-'Temps corr'!L$4","v":"00:14:16"}]
[{"$f":"'Temps corr'!A29","v":25},{"$f":"'Temps corr'!B29","v":"VILLENNES - POISSY AC 2"},{"$f":"'Temps corr'!C29","v":"ACVP2"},{"$f":"'Temps corr'!D29","v":"Franck CARIOU-Michael LE BANNER-Valerie DECAESTECKER-Karine GUILBON-Christophe ELINE"},{"$f":"VLOOKUP(A29,Equipes!A:J,2,FALSE)","v":"M"},{"$f":"ROUND(VLOOKUP(A29,Equipes!$A$2:$J$41,10,0),0)","v":54},{"$f":"'Temps corr'!H29-'Temps corr'!H$4","v":"00:03:03"},{"$f":"'Temps corr'!I29-'Temps corr'!I$4","v":"00:07:06"},{"$f":"'Temps corr'!K29-'Temps corr'!K$4","v":"00:11:39"},{"$f":"'Temps corr'!L29-'Temps corr'!L$4","v":"00:16:39"}]
[{"$f":"'Temps corr'!A30","v":26},{"$f":"'Temps corr'!B30","v":"EVRY SCA 1"},{"$f":"'Temps corr'!C30","v":"SCA 1"},{"$f":"'Temps corr'!D30","v":"Anne CARDUNER-Olivia PEZZOLI-Bruno CASIMIR-Lionel BOISSONNAT-Kristell MAUCHET"},{"$f":"VLOOKUP(A30,Equipes!A:J,2,FALSE)","v":"M"},{"$f":"ROUND(VLOOKUP(A30,Equipes!$A$2:$J$41,10,0),0)","v":56},{"$f":"'Temps corr'!H30-'Temps corr'!H$4","v":"00:06:03"},{"$f":"'Temps corr'!I30-'Temps corr'!I$4","v":"00:11:51"},{"$f":"'Temps corr'!K30-'Temps corr'!K$4","v":"00:17:54"},{"$f":"'Temps corr'!L30-'Temps corr'!L$4","v":"00:24:42"}]
[{"$f":"'Temps corr'!A31","v":27},{"$f":"'Temps corr'!B31","v":"MEULAN LES MUREAUX AMMH 1"},{"$f":"'Temps corr'!C31","v":"AMMH1"},{"$f":"'Temps corr'!D31","v":"Gwenaelle MARSAIS-Sophie SEFFAR-Catherine MARTINIER-Christelle GOANVIC-Marie LAMORE"},{"$f":"VLOOKUP(A31,Equipes!A:J,2,FALSE)","v":"F"},{"$f":"ROUND(VLOOKUP(A31,Equipes!$A$2:$J$41,10,0),0)","v":47},{"$f":"'Temps corr'!H31-'Temps corr'!H$4","v":"00:09:39"},{"$f":"'Temps corr'!I31-'Temps corr'!I$4","v":"00:19:55"},{"$f":"'Temps corr'!K31-'Temps corr'!K$4","v":"00:29:13"},{"$f":"'Temps corr'!L31-'Temps corr'!L$4","v":"00:37:59"}]
[{"$f":"'Temps corr'!A32","v":28},{"$f":"'Temps corr'!B32","v":"VILLENNES - POISSY AC 1"},{"$f":"'Temps corr'!C32","v":"ACVP1"},{"$f":"'Temps corr'!D32","v":"Frederic LE ROUX-Corinne HUARD-ROLLAND-Elodie DEREMIENCE-Marie-Claude LAUNAY-Olivier COSNEAU"},{"$f":"VLOOKUP(A32,Equipes!A:J,2,FALSE)","v":"M"},{"$f":"ROUND(VLOOKUP(A32,Equipes!$A$2:$J$41,10,0),0)","v":53},{"$f":"'Temps corr'!H32-'Temps corr'!H$4","v":"00:02:39"},{"$f":"'Temps corr'!I32-'Temps corr'!I$4","v":"00:05:35"},{"$f":"'Temps corr'!K32-'Temps corr'!K$4","v":"00:07:29"},{"$f":"'Temps corr'!L32-'Temps corr'!L$4","v":"00:09:19"}]
[{"$f":"'Temps corr'!A33","v":29},{"$f":"'Temps corr'!B33","v":"FONTAINEBLEAU APF 1"},{"$f":"'Temps corr'!C33","v":"APF1"},{"$f":"'Temps corr'!D33","v":"Kathleen SANCHEZ-Laurent FOUQUE-Christian MESSALES-Denis FLORY-David WEBER"},{"$f":"VLOOKUP(A33,Equipes!A:J,2,FALSE)","v":"H"},{"$f":"ROUND(VLOOKUP(A33,Equipes!$A$2:$J$41,10,0),0)","v":57},{"$f":"'Temps corr'!H33-'Temps corr'!H$4","v":"00:06:39"},{"$f":"'Temps corr'!I33-'Temps corr'!I$4","v":"00:13:31"},{"$f":"'Temps corr'!K33-'Temps corr'!K$4","v":"00:18:55"},{"$f":"'Temps corr'!L33-'Temps corr'!L$4","v":"00:26:17"}]
[{"$f":"'Temps corr'!A34","v":30},{"$f":"'Temps corr'!B34","v":"JOINVILLE AMJ 1"},{"$f":"'Temps corr'!C34","v":"AMJ1"},{"$f":"'Temps corr'!D34","v":"Vincent FABIEN-Arnaud PUPPO-Jonathan ROOKE-Xavier SUCHET-Nicolas JAMAULT"},{"$f":"VLOOKUP(A34,Equipes!A:J,2,FALSE)","v":"H"},{"$f":"ROUND(VLOOKUP(A34,Equipes!$A$2:$J$41,10,0),0)","v":51},{"$f":"'Temps corr'!H34-'Temps corr'!H$4","v":"00:03:51"},{"$f":"'Temps corr'!I34-'Temps corr'!I$4","v":"00:07:58"},{"$f":"'Temps corr'!K34-'Temps corr'!K$4","v":"00:10:41"},{"$f":"'Temps corr'!L34-'Temps corr'!L$4","v":"00:19:18"}]
[{"$f":"'Temps corr'!A35","v":31},{"$f":"'Temps corr'!B35","v":"NOGENT SUR MARNE CN 3"},{"$f":"'Temps corr'!C35","v":"CN3"},{"$f":"'Temps corr'!D35","v":"Alexandra COHEN SALMON-Isabelle MILON-BANNEROT-Jerome TROMBOFSKY-Olivier PASCAL-Elisabeth LAUNAY"},{"$f":"VLOOKUP(A35,Equipes!A:J,2,FALSE)","v":"M"},{"$f":"ROUND(VLOOKUP(A35,Equipes!$A$2:$J$41,10,0),0)","v":53},{"$f":"'Temps corr'!H35-'Temps corr'!H$4","v":"00:08:28"},{"$f":"'Temps corr'!I35-'Temps corr'!I$4","v":"00:15:36"},{"$f":"'Temps corr'!K35-'Temps corr'!K$4","v":"00:25:36"},{"$f":"'Temps corr'!L35-'Temps corr'!L$4","v":"00:34:59"}]
[{"$f":"'Temps corr'!A36","v":32},{"$f":"'Temps corr'!B36","v":"BOULOGNE 92 1"},{"$f":"'Temps corr'!C36","v":"ACBB1"},{"$f":"'Temps corr'!D36","v":"Isabelle MAIRE-Théo BEL BERBEL- LURBE-Thã‰Odore SEDAROS-Omar OUAZZANI-Alexandra MENEZES"},{"$f":"VLOOKUP(A36,Equipes!A:J,2,FALSE)","v":"H"},{"$f":"ROUND(VLOOKUP(A36,Equipes!$A$2:$J$41,10,0),0)","v":43},{"$f":"'Temps corr'!H36-'Temps corr'!H$4","v":{"$error":"#VALUE!"}},{"$f":"'Temps corr'!I36-'Temps corr'!I$4","v":{"$error":"#VALUE!"}},{"$f":"'Temps corr'!K36-'Temps corr'!K$4","v":{"$error":"#VALUE!"}},{"$f":"'Temps corr'!L36-'Temps corr'!L$4","v":{"$error":"#VALUE!"}}]
[{"$f":"'Temps corr'!A37","v":33},{"$f":"'Temps corr'!B37","v":"XX"},{"$f":"'Temps corr'!C37","v":"XX"},{"$f":"'Temps corr'!D37","v":"XX-XX-XX-XX-XX"},{"$f":"VLOOKUP(A37,Equipes!A:J,2,FALSE)","v":"X"},{"$f":"ROUND(VLOOKUP(A37,Equipes!$A$2:$J$41,10,0),0)","v":0},{"$f":"'Temps corr'!H37-'Temps corr'!H$4","v":{"$error":"#VALUE!"}},{"$f":"'Temps corr'!I37-'Temps corr'!I$4","v":{"$error":"#VALUE!"}},{"$f":"'Temps corr'!K37-'Temps corr'!K$4","v":{"$error":"#VALUE!"}},{"$f":"'Temps corr'!L37-'Temps corr'!L$4","v":{"$error":"#VALUE!"}}]
[{"$f":"'Temps corr'!A38","v":34},{"$f":"'Temps corr'!B38","v":"XX"},{"$f":"'Temps corr'!C38","v":"XX"},{"$f":"'Temps corr'!D38","v":"XX-XX-XX-XX-XX"},{"$f":"VLOOKUP(A38,Equipes!A:J,2,FALSE)","v":"X"},{"$f":"ROUND(VLOOKUP(A38,Equipes!$A$2:$J$41,10,0),0)","v":0},{"$f":"'Temps corr'!H38-'Temps corr'!H$4","v":{"$error":"#VALUE!"}},{"$f":"'Temps corr'!I38-'Temps corr'!I$4","v":-3.7499999999999756E-3},{"$f":"'Temps corr'!K38-'Temps corr'!K$4","v":{"$error":"#VALUE!"}},{"$f":"'Temps corr'!L38-'Temps corr'!L$4","v":-1.1701388888888886E-2}]
[{"$f":"'Temps corr'!A39","v":35},{"$f":"'Temps corr'!B39","v":"XX"},{"$f":"'Temps corr'!C39","v":"XX"},{"$f":"'Temps corr'!D39","v":"XX-XX-XX-XX-XX"},{"$f":"VLOOKUP(A39,Equipes!A:J,2,FALSE)","v":"X"},{"$f":"ROUND(VLOOKUP(A39,Equipes!$A$2:$J$41,10,0),0)","v":0},{"$f":"'Temps corr'!H39-'Temps corr'!H$4","v":{"$error":"#VALUE!"}},{"$f":"'Temps corr'!I39-'Temps corr'!I$4","v":{"$error":"#VALUE!"}},{"$f":"'Temps corr'!K39-'Temps corr'!K$4","v":{"$error":"#VALUE!"}},{"$f":"'Temps corr'!L39-'Temps corr'!L$4","v":{"$error":"#VALUE!"}}]
[{"$f":"'Temps corr'!A40","v":36},{"$f":"'Temps corr'!B40","v":"XX"},{"$f":"'Temps corr'!C40","v":"XX"},{"$f":"'Temps corr'!D40","v":"XX-XX-XX-XX-XX"},{"$f":"VLOOKUP(A40,Equipes!A:J,2,FALSE)","v":"X"},{"$f":"ROUND(VLOOKUP(A40,Equipes!$A$2:$J$41,10,0),0)","v":0},{"$f":"'Temps corr'!H40-'Temps corr'!H$4","v":{"$error":"#VALUE!"}},{"$f":"'Temps corr'!I40-'Temps corr'!I$4","v":{"$error":"#VALUE!"}},{"$f":"'Temps corr'!K40-'Temps corr'!K$4","v":{"$error":"#VALUE!"}},{"$f":"'Temps corr'!L40-'Temps corr'!L$4","v":{"$error":"#VALUE!"}}]
[{"$f":"'Temps corr'!A41","v":37},{"$f":"'Temps corr'!B41","v":"XX"},{"$f":"'Temps corr'!C41","v":"XX"},{"$f":"'Temps corr'!D41","v":"XX-XX-XX-XX-XX"},{"$f":"VLOOKUP(A41,Equipes!A:J,2,FALSE)","v":"X"},{"$f":"ROUND(VLOOKUP(A41,Equipes!$A$2:$J$41,10,0),0)","v":0},{"$f":"'Temps corr'!H41-'Temps corr'!H$4","v":{"$error":"#VALUE!"}},{"$f":"'Temps corr'!I41-'Temps corr'!I$4","v":{"$error":"#VALUE!"}},{"$f":"'Temps corr'!K41-'Temps corr'!K$4","v":{"$error":"#VALUE!"}},{"$f":"'Temps corr'!L41-'Temps corr'!L$4","v":{"$error":"#VALUE!"}}]
[{"$f":"'Temps corr'!A42","v":38},{"$f":"'Temps corr'!B42","v":"XX"},{"$f":"'Temps corr'!C42","v":"XX"},{"$f":"'Temps corr'!D42","v":"XX-XX-XX-XX-XX"},{"$f":"VLOOKUP(A42,Equipes!A:J,2,FALSE)","v":"X"},{"$f":"ROUND(VLOOKUP(A42,Equipes!$A$2:$J$41,10,0),0)","v":0},{"$f":"'Temps corr'!H42-'Temps corr'!H$4","v":{"$error":"#VALUE!"}},{"$f":"'Temps corr'!I42-'Temps corr'!I$4","v":{"$error":"#VALUE!"}},{"$f":"'Temps corr'!K42-'Temps corr'!K$4","v":{"$error":"#VALUE!"}},{"$f":"'Temps corr'!L42-'Temps corr'!L$4","v":{"$error":"#VALUE!"}}]
[{"$f":"'Temps corr'!A43","v":39},{"$f":"'Temps corr'!B43","v":"XX"},{"$f":"'Temps corr'!C43","v":"XX"},{"$f":"'Temps corr'!D43","v":"XX-XX-XX-XX-XX"},{"$f":"VLOOKUP(A43,Equipes!A:J,2,FALSE)","v":"X"},{"$f":"ROUND(VLOOKUP(A43,Equipes!$A$2:$J$41,10,0),0)","v":0},{"$f":"'Temps corr'!H43-'Temps corr'!H$4","v":{"$error":"#VALUE!"}},{"$f":"'Temps corr'!I43-'Temps corr'!I$4","v":{"$error":"#VALUE!"}},{"$f":"'Temps corr'!K43-'Temps corr'!K$4","v":{"$error":"#VALUE!"}},{"$f":"'Temps corr'!L43-'Temps corr'!L$4","v":{"$error":"#VALUE!"}}]
[{"$f":"'Temps corr'!A44","v":40},{"$f":"'Temps corr'!B44","v":"XX"},{"$f":"'Temps corr'!C44","v":"XX"},{"$f":"'Temps corr'!D44","v":"XX-XX-XX-XX-XX"},{"$f":"VLOOKUP(A44,Equipes!A:J,2,FALSE)","v":"X"},{"$f":"ROUND(VLOOKUP(A44,Equipes!$A$2:$J$41,10,0),0)","v":0},{"$f":"'Temps corr'!H44-'Temps corr'!H$4","v":{"$error":"#VALUE!"}},{"$f":"'Temps corr'!I44-'Temps corr'!I$4","v":{"$error":"#VALUE!"}},{"$f":"'Temps corr'!K44-'Temps corr'!K$4","v":{"$error":"#VALUE!"}},{"$f":"'Temps corr'!L44-'Temps corr'!L$4","v":{"$error":"#VALUE!"}}]

{"sheet":"CL mi parcours","index":19,"n_rows":44,"n_cols":10,"rows_kept":44,"cut":false,"hidden":false,"merged":[[0,6,1,9],[0,4,1,5],[0,0,1,3]]}
["GRAND 8 ",null,null,null,{"$f":"'Note explicative fichier'!E3","v":"2024-06-02"},null,"CLASSEMENT A MI COURSE"]
[]
["Yolette N°","Club","Ville","Equipage","Cat.","Age Moyen","1 / 2\nG-8","Ecart / Record","Ecart / Ier N-1"]
[{"$f":"'Temps corr'!A4","v":"Record"},{"$f":"'Temps corr'!B4","v":"POLYTECHNIQUE ( Référence 2012 )"},{"$f":"'Temps corr'!C4","v":"Palaiseau"},{"$f":"'Temps corr'!D4","v":"FERRERO Michel - Alexandre Rosinski - BOYAUD Mathieu - GODDE Olivier - THECKES Benoit"},null,null,null,{"$f":"'Temps corr'!I4","v":"00:40:41"},{"$f":"G5","v":"00:43:56"},"Position\nProvisoire"]
[{"$f":"'TEMPS-ponton'!A20","v":16},{"$f":"'TEMPS-ponton'!B20","v":"PORT-MARLY RC 1"},{"$f":"'TEMPS-ponton'!C20","v":"RCPM1"},{"$f":"'TEMPS-ponton'!D20","v":"Jean-Claude LAFOREST-David CHARTIER-Christophe MARCAIS-Vincent BONTOUX-Alain ROUSSEAU"},{"$f":"VLOOKUP(A5,Equipes!A:J,2,FALSE)","v":"H"},{"$f":"ROUND(VLOOKUP(A5,Equipes!$A$2:$J$41,10,0),0)","v":55},"00:43:56",{"$f":"G5-$H$4","v":"00:03:15"},{"$f":"G5-$I$4","v":"00:00:00"},1]
[{"$f":"'TEMPS-ponton'!A17","v":13},{"$f":"'TEMPS-ponton'!B17","v":"PORT-MARLY RC 2"},{"$f":"'TEMPS-ponton'!C17","v":"RCPM2"},{"$f":"'TEMPS-ponton'!D17","v":"Elsa CROZATIER-Cyrielle BERTHIER-Hervé Valette-Eric MOINARD-Anais FEUGA"},{"$f":"VLOOKUP(A6,Equipes!A:J,2,FALSE)","v":"M"},{"$f":"ROUND(VLOOKUP(A6,Equipes!$A$2:$J$41,10,0),0)","v":47},"00:45:45","00:05:04","00:01:49",{"$f":"J5+1","v":2}]
[{"$f":"'TEMPS-ponton'!A25","v":21},{"$f":"'TEMPS-ponton'!B25","v":"PORT-MARLY RC 2"},{"$f":"'TEMPS-ponton'!C25","v":"RCPM2"},{"$f":"'TEMPS-ponton'!D25","v":"Guillaume CHARRON-Philippe VERHE-Stephan REYNIER-Dominique LEROUX-Luciano AUTUNNALE"},{"$f":"VLOOKUP(A7,Equipes!A:J,2,FALSE)","v":"H"},{"$f":"ROUND(VLOOKUP(A7,Equipes!$A$2:$J$41,10,0),0)","v":51},"00:46:04","00:05:23","00:02:08",{"$f":"J6+1","v":3}]
[{"$f":"'TEMPS-ponton'!A32","v":28},{"$f":"'TEMPS-ponton'!B32","v":"VILLENNES - POISSY AC 1"},{"$f":"'TEMPS-ponton'!C32","v":"ACVP1"},{"$f":"'TEMPS-ponton'!D32","v":"Frederic LE ROUX-Corinne HUARD-ROLLAND-Elodie DEREMIENCE-Marie-Claude LAUNAY-Olivier COSNEAU"},{"$f":"VLOOKUP(A8,Equipes!A:J,2,FALSE)","v":"M"},{"$f":"ROUND(VLOOKUP(A8,Equipes!$A$2:$J$41,10,0),0)","v":53},"00:46:16","00:05:35","00:02:20",4]
[{"$f":"'TEMPS-ponton'!A16","v":12},{"$f":"'TEMPS-ponton'!B16","v":"EVRY SCA 2"},{"$f":"'TEMPS-ponton'!C16","v":"SCA2"},{"$f":"'TEMPS-ponton'!D16","v":"Laurent YEBOAH-Isabelle MOISSET FLEURISSON-Frederic DUCAUQUY-Sandrine GARCIA-Christelle MARTIN"},{"$f":"VLOOKUP(A9,Equipes!A:J,2,FALSE)","v":"M"},{"$f":"ROUND(VLOOKUP(A9,Equipes!$A$2:$J$41,10,0),0)","v":48},"00:46:23","00:05:42","00:02:27",5]
[{"$f":"'TEMPS-ponton'!A19","v":15},{"$f":"'TEMPS-ponton'!B19","v":"SOISY SUR SEINE CN 1"},{"$f":"'TEMPS-ponton'!C19","v":"CN1"},{"$f":"'TEMPS-ponton'!D19","v":"Bertrand PIOGER-Bruno PERIQUOI-Servane BERTRAND-Alain BERNARD-Robert TRAUET"},{"$f":"VLOOKUP(A10,Equipes!A:J,2,FALSE)","v":"H"},{"$f":"ROUND(VLOOKUP(A10,Equipes!$A$2:$J$41,10,0),0)","v":54},"00:47:07","00:06:26","00:03:11",6]
[{"$f":"'TEMPS-ponton'!A14","v":10},{"$f":"'TEMPS-ponton'!B14","v":"NOGENT SUR MARNE CN 2"},{"$f":"'TEMPS-ponton'!C14","v":"CN2"},{"$f":"'TEMPS-ponton'!D14","v":"Christophe RUCKEBUSCH-Nicolas BURCKHART-Alice GHEERBRANT-Aurelie DONVAL-Gerard LECA"},{"$f":"VLOOKUP(A11,Equipes!A:J,2,FALSE)","v":"M"},{"$f":"ROUND(VLOOKUP(A11,Equipes!$A$2:$J$41,10,0),0)","v":53},"00:47:45","00:07:04","00:03:49",7]
[{"$f":"'TEMPS-ponton'!A29","v":25},{"$f":"'TEMPS-ponton'!B29","v":"VILLENNES - POISSY AC 2"},{"$f":"'TEMPS-ponton'!C29","v":"ACVP2"},{"$f":"'TEMPS-ponton'!D29","v":"Franck CARIOU-Michael LE BANNER-Valerie DECAESTECKER-Karine GUILBON-Christophe ELINE"},{"$f":"VLOOKUP(A12,Equipes!A:J,2,FALSE)","v":"M"},{"$f":"ROUND(VLOOKUP(A12,Equipes!$A$2:$J$41,10,0),0)","v":54},"00:47:47","00:07:06","00:03:51",8]
[{"$f":"'TEMPS-ponton'!A28","v":24},{"$f":"'TEMPS-ponton'!B28","v":"MEULAN LES MUREAUX AMMH 1"},{"$f":"'TEMPS-ponton'!C28","v":"AMMH1"},{"$f":"'TEMPS-ponton'!D28","v":"Xavier MARSAIS-Eric PRENEY-Yannick DAGMEY-David COINE-Arthur VAN SLOOTEN"},{"$f":"VLOOKUP(A13,Equipes!A:J,2,FALSE)","v":"H"},{"$f":"ROUND(VLOOKUP(A13,Equipes!$A$2:$J$41,10,0),0)","v":53},"00:47:59","00:07:18","00:04:03",9]
[{"$f":"'TEMPS-ponton'!A12","v":8},{"$f":"'TEMPS-ponton'!B12","v":"JOINVILLE AMJ 1"},{"$f":"'TEMPS-ponton'!C12","v":"Joinville"},{"$f":"'TEMPS-ponton'!D12","v":"Laurent BAUDOIN-Raphaelle BOUVIER FLORY-Sophie BUSTOS-Kastriot JAKA-Thomas AUGER"},{"$f":"VLOOKUP(A14,Equipes!A:J,2,FALSE)","v":"M"},{"$f":"ROUND(VLOOKUP(A14,Equipes!$A$2:$J$41,10,0),0)","v":46},"00:48:05","00:07:24","00:04:09",10]
[{"$f":"'TEMPS-ponton'!A34","v":30},{"$f":"'TEMPS-ponton'!B34","v":"JOINVILLE AMJ 1"},{"$f":"'TEMPS-ponton'!C34","v":"AMJ1"},{"$f":"'TEMPS-ponton'!D34","v":"Vincent FABIEN-Arnaud PUPPO-Jonathan ROOKE-Xavier SUCHET-Nicolas JAMAULT"},{"$f":"VLOOKUP(A15,Equipes!A:J,2,FALSE)","v":"H"},{"$f":"ROUND(VLOOKUP(A15,Equipes!$A$2:$J$41,10,0),0)","v":51},"00:48:39","00:07:58","00:04:43",11]
[{"$f":"'TEMPS-ponton'!A18","v":14},{"$f":"'TEMPS-ponton'!B18","v":"MAISONS MESNIL CERAMM 1"},{"$f":"'TEMPS-ponton'!C18","v":"CERAMM1"},{"$f":"'TEMPS-ponton'!D18","v":"Nicolas SCHMITT-Gloria VENDRELL-Christine MARIE LAVAUD-Amaury DE LA LAURENCIE-Amina ELABBADI"},{"$f":"VLOOKUP(A16,Equipes!A:J,2,FALSE)","v":"M"},{"$f":"ROUND(VLOOKUP(A16,Equipes!$A$2:$J$41,10,0),0)","v":50},"00:49:52","00:09:11","00:05:56",12]
[{"$f":"'TEMPS-ponton'!A13","v":9},{"$f":"'TEMPS-ponton'!B13","v":"NOGENT SUR MARNE CN 1"},{"$f":"'TEMPS-ponton'!C13","v":"CN 1"},{"$f":"'TEMPS-ponton'!D13","v":"Chrystelle SUPIOT-Caroline PIEDNOIRE-Olivier MUCIGNAT-Andre SIMONNET-Fabienne LORTIE"},{"$f":"VLOOKUP(A17,Equipes!A:J,2,FALSE)","v":"M"},{"$f":"ROUND(VLOOKUP(A17,Equipes!$A$2:$J$41,10,0),0)","v":53},"00:50:22","00:09:41","00:06:26",13]
[{"$f":"'TEMPS-ponton'!A10","v":6},{"$f":"'TEMPS-ponton'!B10","v":"BOULOGNE 92 2"},{"$f":"'TEMPS-ponton'!C10","v":"ACBB"},{"$f":"'TEMPS-ponton'!D10","v":"CéLia ROUSSELLE-Marie Pierre MARSALLON GAMBY-Françis ROBIN-Nicolas LECOEUR-Theodora XENOGIANI"},{"$f":"VLOOKUP(A18,Equipes!A:J,2,FALSE)","v":"M"},{"$f":"ROUND(VLOOKUP(A18,Equipes!$A$2:$J$41,10,0),0)","v":46},"00:50:41","00:10:00","00:06:45",14]
[{"$f":"'TEMPS-ponton'!A24","v":20},{"$f":"'TEMPS-ponton'!B24","v":"ROUEN CNAR 1"},{"$f":"'TEMPS-ponton'!C24","v":"CNAR1"},{"$f":"'TEMPS-ponton'!D24","v":"Nathalie MOUSSET-Francois LAIR-Betty GESLAIN-Thierry DUCHESNE-Stephane MOUSSET"},{"$f":"VLOOKUP(A19,Equipes!A:J,2,FALSE)","v":"M"},{"$f":"ROUND(VLOOKUP(A19,Equipes!$A$2:$J$41,10,0),0)","v":55},"00:50:41","00:10:00","00:06:45",15]
[{"$f":"'TEMPS-ponton'!A22","v":18},{"$f":"'TEMPS-ponton'!B22","v":"MAISONS MESNIL CERAMM 2"},{"$f":"'TEMPS-ponton'!C22","v":"CERAMM2"},{"$f":"'TEMPS-ponton'!D22","v":"Claude LEMENAGER-Didier GIRARDEAU-Laurent LIBOTTE-Alain GIRARD-Cecile JEAMMES"},{"$f":"VLOOKUP(A20,Equipes!A:J,2,FALSE)","v":"H"},{"$f":"ROUND(VLOOKUP(A20,Equipes!$A$2:$J$41,10,0),0)","v":58},"00:51:09","00:10:28","00:07:13",16]
[{"$f":"'TEMPS-ponton'!A11","v":7},{"$f":"'TEMPS-ponton'!B11","v":"VILLENNES - POISSY AC 3"},{"$f":"'TEMPS-ponton'!C11","v":"ACVP"},{"$f":"'TEMPS-ponton'!D11","v":"Virginie ALEXANDRE-Jihad LEMARQRI-Cyrille BRUZON-BASCOU-Sebastien CARPENTIER-Marie Estelle D'ARBAUMONT"},{"$f":"VLOOKUP(A21,Equipes!A:J,2,FALSE)","v":"M"},{"$f":"ROUND(VLOOKUP(A21,Equipes!$A$2:$J$41,10,0),0)","v":49},"00:51:27","00:10:46","00:07:31",17]
[{"$f":"'TEMPS-ponton'!A26","v":22},{"$f":"'TEMPS-ponton'!B26","v":"COUDRAY MONTCEAUX A 1"},{"$f":"'TEMPS-ponton'!C26","v":"coudray1"},{"$f":"'TEMPS-ponton'!D26","v":"Joseph RAYNAUD-Frederic MORAT-Benjamin HOUILLON-Pascal BEAUSSART-Anne HOUAL"},{"$f":"VLOOKUP(A22,Equipes!A:J,2,FALSE)","v":"H"},{"$f":"ROUND(VLOOKUP(A22,Equipes!$A$2:$J$41,10,0),0)","v":52},"00:51:40","00:10:59","00:07:44",18]
[{"$f":"'TEMPS-ponton'!A23","v":19},{"$f":"'TEMPS-ponton'!B23","v":"VILLENNES - POISSY AC 1"},{"$f":"'TEMPS-ponton'!C23","v":"ACVP1"},{"$f":"'TEMPS-ponton'!D23","v":"Olivier POLGE-Odile POLGE-Laurent BONHOMMET-Antoine VOLPI-Philippe STROHM"},{"$f":"VLOOKUP(A23,Equipes!A:J,2,FALSE)","v":"H"},{"$f":"ROUND(VLOOKUP(A23,Equipes!$A$2:$J$41,10,0),0)","v":55},"00:52:02","00:11:21","00:08:06",19]
[{"$f":"'TEMPS-ponton'!A6","v":2},{"$f":"'TEMPS-ponton'!B6","v":"CAUDEBEC EN CAUX ACVS 1"},{"$f":"'TEMPS-ponton'!C6","v":"Caudebec"},{"$f":"'TEMPS-ponton'!D6","v":"Martine NARBAIS-JAUREGUY-Caroline KERVRANN-Stephane DELAMARE-Nicolas BARRAY-Francois NARBAIS-JAUREGUY"},{"$f":"VLOOKUP(A24,Equipes!A:J,2,FALSE)","v":"M"},{"$f":"ROUND(VLOOKUP(A24,Equipes!$A$2:$J$41,10,0),0)","v":55},"00:52:22","00:11:41","00:08:26",20]
[{"$f":"'TEMPS-ponton'!A30","v":26},{"$f":"'TEMPS-ponton'!B30","v":"EVRY SCA 1"},{"$f":"'TEMPS-ponton'!C30","v":"SCA 1"},{"$f":"'TEMPS-ponton'!D30","v":"Anne CARDUNER-Olivia PEZZOLI-Bruno CASIMIR-Lionel BOISSONNAT-Kristell MAUCHET"},{"$f":"VLOOKUP(A25,Equipes!A:J,2,FALSE)","v":"M"},{"$f":"ROUND(VLOOKUP(A25,Equipes!$A$2:$J$41,10,0),0)","v":56},"00:52:32","00:11:51","00:08:36",21]
[{"$f":"'TEMPS-ponton'!A8","v":4},{"$f":"'TEMPS-ponton'!B8","v":"ANDRESY CA CONFLUENT 1"},{"$f":"'TEMPS-ponton'!C8","v":"CAC3"},{"$f":"'TEMPS-ponton'!D8","v":"Emmanuel SALIN-Ousseni PARKOUDA-Jean-Baptiste PROVENZANO-Jerome CLAVE-Julian GALLELA"},{"$f":"VLOOKUP(A26,Equipes!A:J,2,FALSE)","v":"H"},{"$f":"ROUND(VLOOKUP(A26,Equipes!$A$2:$J$41,10,0),0)","v":46},"00:53:48","00:13:07","00:09:52",22]
[{"$f":"'TEMPS-ponton'!A33","v":29},{"$f":"'TEMPS-ponton'!B33","v":"FONTAINEBLEAU APF 1"},{"$f":"'TEMPS-ponton'!C33","v":"APF1"},{"$f":"'TEMPS-ponton'!D33","v":"Kathleen SANCHEZ-Laurent FOUQUE-Christian MESSALES-Denis FLORY-David WEBER"},{"$f":"VLOOKUP(A27,Equipes!A:J,2,FALSE)","v":"H"},{"$f":"ROUND(VLOOKUP(A27,Equipes!$A$2:$J$41,10,0),0)","v":57},"00:54:12","00:13:31","00:10:16",23]
[{"$f":"'TEMPS-ponton'!A9","v":5},{"$f":"'TEMPS-ponton'!B9","v":"PORT-MARLY RC 1"},{"$f":"'TEMPS-ponton'!C9","v":"RCPM"},{"$f":"'TEMPS-ponton'!D9","v":"Claudie BODIN-Fanny LAMOUR-Etienne DUPUIS-Jeancharles FAUCHEUX-Gildas KETTANJIAN"},{"$f":"VLOOKUP(A28,Equipes!A:J,2,FALSE)","v":"M"},{"$f":"ROUND(VLOOKUP(A28,Equipes!$A$2:$J$41,10,0),0)","v":50},"00:54:34","00:13:53","00:10:38",24]
[{"$f":"'TEMPS-ponton'!A15","v":11},{"$f":"'TEMPS-ponton'!B15","v":"BOULOGNE 92 1"},{"$f":"'TEMPS-ponton'!C15","v":"ACBB"},{"$f":"'TEMPS-ponton'!D15","v":"Viviane BALLOY-Timothé BAZIRIES-Alexandre LE FUR-Sigrid PABST-Michel VEDRINE"},{"$f":"VLOOKUP(A29,Equipes!A:J,2,FALSE)","v":"H"},{"$f":"ROUND(VLOOKUP(A29,Equipes!$A$2:$J$41,10,0),0)","v":51},"00:54:40","00:13:59","00:10:44",25]
[{"$f":"'TEMPS-ponton'!A35","v":31},{"$f":"'TEMPS-ponton'!B35","v":"NOGENT SUR MARNE CN 3"},{"$f":"'TEMPS-ponton'!C35","v":"CN3"},{"$f":"'TEMPS-ponton'!D35","v":"Alexandra COHEN SALMON-Isabelle MILON-BANNEROT-Jerome TROMBOFSKY-Olivier PASCAL-Elisabeth LAUNAY"},{"$f":"VLOOKUP(A30,Equipes!A:J,2,FALSE)","v":"M"},{"$f":"ROUND(VLOOKUP(A30,Equipes!$A$2:$J$41,10,0),0)","v":53},"00:56:17","00:15:36","00:12:21",26]
[{"$f":"'TEMPS-ponton'!A27","v":23},{"$f":"'TEMPS-ponton'!B27","v":"SN OISE 1"},{"$f":"'TEMPS-ponton'!C27","v":"SN Oise 1\n"},{"$f":"'TEMPS-ponton'!D27","v":"Agnes AUDEBERT-Nicolas RAUCH-Jerome ROUGE-Nathalie BAUDIER-Isabelle JOUBERT"},{"$f":"VLOOKUP(A31,Equipes!A:J,2,FALSE)","v":"M"},{"$f":"ROUND(VLOOKUP(A31,Equipes!$A$2:$J$41,10,0),0)","v":50},"00:56:32","00:15:51","00:12:36",27]
[{"$f":"'TEMPS-ponton'!A5","v":1},{"$f":"'TEMPS-ponton'!B5","v":"ANDRESY CA CONFLUENT 1"},{"$f":"'TEMPS-ponton'!C5","v":"Cac1"},{"$f":"'TEMPS-ponton'!D5","v":"Stephanie LAPORTE-Marine NACERI-Marc LACCASSAGNE-Stephane ZETTWOOG-Fouzia VOIRIN"},{"$f":"VLOOKUP(A32,Equipes!A:J,2,FALSE)","v":"M"},{"$f":"ROUND(VLOOKUP(A32,Equipes!$A$2:$J$41,10,0),0)","v":49},"00:57:57","00:17:16","00:14:01",28]
[{"$f":"'TEMPS-ponton'!A21","v":17},{"$f":"'TEMPS-ponton'!B21","v":"ANDRESY CA CONFLUENT 1"},{"$f":"'TEMPS-ponton'!C21","v":"CAC1"},{"$f":"'TEMPS-ponton'!D21","v":"Daphne PARIZOT-Agnes BURGHGRAEVE SELLEN-Sylvie FRANSSEN-Severine LEGAILLARD-Martine LE ROUX"},{"$f":"VLOOKUP(A33,Equipes!A:J,2,FALSE)","v":"F"},{"$f":"ROUND(VLOOKUP(A33,Equipes!$A$2:$J$41,10,0),0)","v":55},"00:59:40","00:18:59","00:15:44",29]
[{"$f":"'TEMPS-ponton'!A31","v":27},{"$f":"'TEMPS-ponton'!B31","v":"MEULAN LES MUREAUX AMMH 1"},{"$f":"'TEMPS-ponton'!C31","v":"AMMH1"},{"$f":"'TEMPS-ponton'!D31","v":"Gwenaelle MARSAIS-Sophie SEFFAR-Catherine MARTINIER-Christelle GOANVIC-Marie LAMORE"},{"$f":"VLOOKUP(A34,Equipes!A:J,2,FALSE)","v":"F"},{"$f":"ROUND(VLOOKUP(A34,Equipes!$A$2:$J$41,10,0),0)","v":47},"01:00:36","00:19:55","00:16:40",30]
[{"$f":"'TEMPS-ponton'!A7","v":3},{"$f":"'TEMPS-ponton'!B7","v":"ANDRESY CA CONFLUENT 2"},{"$f":"'TEMPS-ponton'!C7","v":"CAC 2"},{"$f":"'TEMPS-ponton'!D7","v":"Anna ALCALOIDEPOIXBLANC-Geoffrey GHIZZONI-Nathalie BOURGEOIS-Franck CHRISTIANNOT-NicOLAS delaunoy"},{"$f":"VLOOKUP(A35,Equipes!A:J,2,FALSE)","v":"M"},{"$f":"ROUND(VLOOKUP(A35,Equipes!$A$2:$J$41,10,0),0)","v":55},"01:00:49","00:20:08","00:16:53",31]
[{"$f":"'TEMPS-ponton'!A36","v":32},{"$f":"'TEMPS-ponton'!B36","v":"BOULOGNE 92 1"},{"$f":"'TEMPS-ponton'!C36","v":"ACBB1"},{"$f":"'TEMPS-ponton'!D36","v":"Isabelle MAIRE-Théo BEL BERBEL- LURBE-Thã‰Odore SEDAROS-Omar OUAZZANI-Alexandra MENEZES"},{"$f":"VLOOKUP(A36,Equipes!A:J,2,FALSE)","v":"H"},{"$f":"ROUND(VLOOKUP(A36,Equipes!$A$2:$J$41,10,0),0)","v":43},"",{"$error":"#VALUE!"},{"$error":"#VALUE!"},32]
[{"$f":"'TEMPS-ponton'!A37","v":33},{"$f":"'TEMPS-ponton'!B37","v":"XX"},{"$f":"'TEMPS-ponton'!C37","v":"XX"},{"$f":"'TEMPS-ponton'!D37","v":"XX-XX-XX-XX-XX"},{"$f":"VLOOKUP(A37,Equipes!A:J,2,FALSE)","v":"X"},{"$f":"ROUND(VLOOKUP(A37,Equipes!$A$2:$J$41,10,0),0)","v":0},"",{"$error":"#VALUE!"},{"$error":"#VALUE!"},33]
[{"$f":"'TEMPS-ponton'!A38","v":34},{"$f":"'TEMPS-ponton'!B38","v":"XX"},{"$f":"'TEMPS-ponton'!C38","v":"XX"},{"$f":"'TEMPS-ponton'!D38","v":"XX-XX-XX-XX-XX"},{"$f":"VLOOKUP(A38,Equipes!A:J,2,FALSE)","v":"X"},{"$f":"ROUND(VLOOKUP(A38,Equipes!$A$2:$J$41,10,0),0)","v":0},"",{"$error":"#VALUE!"},{"$error":"#VALUE!"},34]
[{"$f":"'TEMPS-ponton'!A39","v":35},{"$f":"'TEMPS-ponton'!B39","v":"XX"},{"$f":"'TEMPS-ponton'!C39","v":"XX"},{"$f":"'TEMPS-ponton'!D39","v":"XX-XX-XX-XX-XX"},{"$f":"VLOOKUP(A39,Equipes!A:J,2,FALSE)","v":"X"},{"$f":"ROUND(VLOOKUP(A39,Equipes!$A$2:$J$41,10,0),0)","v":0},"",{"$error":"#VALUE!"},{"$error":"#VALUE!"},35]
[{"$f":"'TEMPS-ponton'!A40","v":36},{"$f":"'TEMPS-ponton'!B40","v":"XX"},{"$f":"'TEMPS-ponton'!C40","v":"XX"},{"$f":"'TEMPS-ponton'!D40","v":"XX-XX-XX-XX-XX"},{"$f":"VLOOKUP(A40,Equipes!A:J,2,FALSE)","v":"X"},{"$f":"ROUND(VLOOKUP(A40,Equipes!$A$2:$J$41,10,0),0)","v":0},"",{"$error":"#VALUE!"},{"$error":"#VALUE!"},36]
[{"$f":"'TEMPS-ponton'!A41","v":37},{"$f":"'TEMPS-ponton'!B41","v":"XX"},{"$f":"'TEMPS-ponton'!C41","v":"XX"},{"$f":"'TEMPS-ponton'!D41","v":"XX-XX-XX-XX-XX"},{"$f":"VLOOKUP(A41,Equipes!A:J,2,FALSE)","v":"X"},{"$f":"ROUND(VLOOKUP(A41,Equipes!$A$2:$J$41,10,0),0)","v":0},"",{"$error":"#VALUE!"},{"$error":"#VALUE!"},37]
[{"$f":"'TEMPS-ponton'!A42","v":38},{"$f":"'TEMPS-ponton'!B42","v":"XX"},{"$f":"'TEMPS-ponton'!C42","v":"XX"},{"$f":"'TEMPS-ponton'!D42","v":"XX-XX-XX-XX-XX"},{"$f":"VLOOKUP(A42,Equipes!A:J,2,FALSE)","v":"X"},{"$f":"ROUND(VLOOKUP(A42,Equipes!$A$2:$J$41,10,0),0)","v":0},"",{"$error":"#VALUE!"},{"$error":"#VALUE!"},38]
[{"$f":"'TEMPS-ponton'!A43","v":39},{"$f":"'TEMPS-ponton'!B43","v":"XX"},{"$f":"'TEMPS-ponton'!C43","v":"XX"},{"$f":"'TEMPS-ponton'!D43","v":"XX-XX-XX-XX-XX"},{"$f":"VLOOKUP(A43,Equipes!A:J,2,FALSE)","v":"X"},{"$f":"ROUND(VLOOKUP(A43,Equipes!$A$2:$J$41,10,0),0)","v":0},"",{"$error":"#VALUE!"},{"$error":"#VALUE!"},39]
[{"$f":"'TEMPS-ponton'!A44","v":40},{"$f":"'TEMPS-ponton'!B44","v":"XX"},{"$f":"'TEMPS-ponton'!C44","v":"XX"},{"$f":"'TEMPS-ponton'!D44","v":"XX-XX-XX-XX-XX"},{"$f":"VLOOKUP(A44,Equipes!A:J,2,FALSE)","v":"X"},{"$f":"ROUND(VLOOKUP(A44,Equipes!$A$2:$J$41,10,0),0)","v":0},"",{"$error":"#VALUE!"},{"$error":"#VALUE!"},{"$f":"J43+1","v":40}]

{"sheet":"Cl Catégories","index":20,"n_rows":44,"n_cols":11,"rows_kept":44,"cut":false,"hidden":false,"merged":[[7,15,8,15],[0,7,1,10],[0,5,1,6],[0,1,1,4]]}
[null,"GRAND HUIT",null,null,null,{"$f":"'Note explicative fichier'!E3","v":"2024-06-02"},null,"CLASSEMENT PAR CATEGORIE"]
[]
[null,"Yolette N°","Club","Ville","Equipage ","Cat.","Age Moyen","Arrivée\nG-8","Ecart record","Ecart / Ier","Position par cat."]
[null,{"$f":"'Temps corr'!A4","v":"Record"},{"$f":"'Temps corr'!B4","v":"POLYTECHNIQUE ( Référence 2012 )"},{"$f":"'Temps corr'!C4","v":"Palaiseau"},{"$f":"'Temps corr'!D4","v":"FERRERO Michel - Alexandre Rosinski - BOYAUD Mathieu - GODDE Olivier - THECKES Benoit"},null,null,{"$f":"'Temps corr'!L4","v":"01:21:48"}]
[{"$f":"CONCATENATE(F5,K5)","v":"F1"},27,"MEULAN LES MUREAUX AMMH 1","AMMH1","Gwenaelle MARSAIS-Sophie SEFFAR-Catherine MARTINIER-Christelle GOANVIC-Marie LAMORE",{"$f":"VLOOKUP(B5,Equipes!A:J,2,FALSE)","v":"F"},{"$f":"ROUND(VLOOKUP(B5,Equipes!$A$2:$J$41,10,0),0)","v":47},"01:59:47",{"$f":"H5-$H$4","v":"00:37:59"},{"$f":"H5-MIN(H$5:H$44)","v":"00:29:22"},{"$f":"IF(F5=F4,K4+1,1)","v":1}]
["F2",17,"ANDRESY CA CONFLUENT 1","CAC1","Daphne PARIZOT-Agnes BURGHGRAEVE SELLEN-Sylvie FRANSSEN-Severine LEGAILLARD-Martine LE ROUX",{"$f":"VLOOKUP(B6,Equipes!A:J,2,FALSE)","v":"F"},{"$f":"ROUND(VLOOKUP(B6,Equipes!$A$2:$J$41,10,0),0)","v":55},"02:01:10","00:39:22","00:30:45",2]
["H1",16,"PORT-MARLY RC 1","RCPM1","Jean-Claude LAFOREST-David CHARTIER-Christophe MARCAIS-Vincent BONTOUX-Alain ROUSSEAU",{"$f":"VLOOKUP(B7,Equipes!A:J,2,FALSE)","v":"H"},{"$f":"ROUND(VLOOKUP(B7,Equipes!$A$2:$J$41,10,0),0)","v":55},"01:30:25","00:08:37","00:00:00",1]
["H2",21,"PORT-MARLY RC 2","RCPM2","Guillaume CHARRON-Philippe VERHE-Stephan REYNIER-Dominique LEROUX-Luciano AUTUNNALE",{"$f":"VLOOKUP(B8,Equipes!A:J,2,FALSE)","v":"H"},{"$f":"ROUND(VLOOKUP(B8,Equipes!$A$2:$J$41,10,0),0)","v":51},"01:31:40","00:09:52","00:01:15",2]
["H3",24,"MEULAN LES MUREAUX AMMH 1","AMMH1","Xavier MARSAIS-Eric PRENEY-Yannick DAGMEY-David COINE-Arthur VAN SLOOTEN",{"$f":"VLOOKUP(B9,Equipes!A:J,2,FALSE)","v":"H"},{"$f":"ROUND(VLOOKUP(B9,Equipes!$A$2:$J$41,10,0),0)","v":53},"01:36:04","00:14:16","00:05:39",3]
["H4",15,"SOISY SUR SEINE CN 1","CN1","Bertrand PIOGER-Bruno PERIQUOI-Servane BERTRAND-Alain BERNARD-Robert TRAUET",{"$f":"VLOOKUP(B10,Equipes!A:J,2,FALSE)","v":"H"},{"$f":"ROUND(VLOOKUP(B10,Equipes!$A$2:$J$41,10,0),0)","v":54},"01:39:08","00:17:20","00:08:43",4]
["H5",19,"VILLENNES - POISSY AC 1","ACVP1","Olivier POLGE-Odile POLGE-Laurent BONHOMMET-Antoine VOLPI-Philippe STROHM",{"$f":"VLOOKUP(B11,Equipes!A:J,2,FALSE)","v":"H"},{"$f":"ROUND(VLOOKUP(B11,Equipes!$A$2:$J$41,10,0),0)","v":55},"01:40:56","00:19:08","00:10:31",5]
["H6",30,"JOINVILLE AMJ 1","AMJ1","Vincent FABIEN-Arnaud PUPPO-Jonathan ROOKE-Xavier SUCHET-Nicolas JAMAULT",{"$f":"VLOOKUP(B12,Equipes!A:J,2,FALSE)","v":"H"},{"$f":"ROUND(VLOOKUP(B12,Equipes!$A$2:$J$41,10,0),0)","v":51},"01:41:06","00:19:18","00:10:41",6]
["H7",18,"MAISONS MESNIL CERAMM 2","CERAMM2","Claude LEMENAGER-Didier GIRARDEAU-Laurent LIBOTTE-Alain GIRARD-Cecile JEAMMES",{"$f":"VLOOKUP(B13,Equipes!A:J,2,FALSE)","v":"H"},{"$f":"ROUND(VLOOKUP(B13,Equipes!$A$2:$J$41,10,0),0)","v":58},"01:41:38","00:19:50","00:11:13",7]
["H8",22,"COUDRAY MONTCEAUX A 1","coudray1","Joseph RAYNAUD-Frederic MORAT-Benjamin HOUILLON-Pascal BEAUSSART-Anne HOUAL",{"$f":"VLOOKUP(B14,Equipes!A:J,2,FALSE)","v":"H"},{"$f":"ROUND(VLOOKUP(B14,Equipes!$A$2:$J$41,10,0),0)","v":52},"01:41:46","00:19:58","00:11:21",8]
["H9",4,"ANDRESY CA CONFLUENT 1","CAC3","Emmanuel SALIN-Ousseni PARKOUDA-Jean-Baptiste PROVENZANO-Jerome CLAVE-Julian GALLELA",{"$f":"VLOOKUP(B15,Equipes!A:J,2,FALSE)","v":"H"},{"$f":"ROUND(VLOOKUP(B15,Equipes!$A$2:$J$41,10,0),0)","v":46},"01:47:27","00:25:39","00:17:02",9]
["H10",29,"FONTAINEBLEAU APF 1","APF1","Kathleen SANCHEZ-Laurent FOUQUE-Christian MESSALES-Denis FLORY-David WEBER",{"$f":"VLOOKUP(B16,Equipes!A:J,2,FALSE)","v":"H"},{"$f":"ROUND(VLOOKUP(B16,Equipes!$A$2:$J$41,10,0),0)","v":57},"01:48:05","00:26:17","00:17:40",10]
["H11",11,"BOULOGNE 92 1","ACBB","Viviane BALLOY-Timothé BAZIRIES-Alexandre LE FUR-Sigrid PABST-Michel VEDRINE",{"$f":"VLOOKUP(B17,Equipes!A:J,2,FALSE)","v":"H"},{"$f":"ROUND(VLOOKUP(B17,Equipes!$A$2:$J$41,10,0),0)","v":51},"01:50:55","00:29:07","00:20:30",11]
["H12",32,"BOULOGNE 92 1","ACBB1","Isabelle MAIRE-Théo BEL BERBEL- LURBE-Thã‰Odore SEDAROS-Omar OUAZZANI-Alexandra MENEZES",{"$f":"VLOOKUP(B18,Equipes!A:J,2,FALSE)","v":"H"},{"$f":"ROUND(VLOOKUP(B18,Equipes!$A$2:$J$41,10,0),0)","v":43},"99:99:99",{"$error":"#VALUE!"},{"$error":"#VALUE!"},12]
["M1",28,"VILLENNES - POISSY AC 1","ACVP1","Frederic LE ROUX-Corinne HUARD-ROLLAND-Elodie DEREMIENCE-Marie-Claude LAUNAY-Olivier COSNEAU",{"$f":"VLOOKUP(B19,Equipes!A:J,2,FALSE)","v":"M"},{"$f":"ROUND(VLOOKUP(B19,Equipes!$A$2:$J$41,10,0),0)","v":53},"01:31:07","00:09:19","00:00:42",1]
["M2",8,"JOINVILLE AMJ 1","Joinville","Laurent BAUDOIN-Raphaelle BOUVIER FLORY-Sophie BUSTOS-Kastriot JAKA-Thomas AUGER",{"$f":"VLOOKUP(B20,Equipes!A:J,2,FALSE)","v":"M"},{"$f":"ROUND(VLOOKUP(B20,Equipes!$A$2:$J$41,10,0),0)","v":46},"01:33:32","00:11:44","00:03:07",2]
["M3",12,"EVRY SCA 2","SCA2","Laurent YEBOAH-Isabelle MOISSET FLEURISSON-Frederic DUCAUQUY-Sandrine GARCIA-Christelle MARTIN",{"$f":"VLOOKUP(B21,Equipes!A:J,2,FALSE)","v":"M"},{"$f":"ROUND(VLOOKUP(B21,Equipes!$A$2:$J$41,10,0),0)","v":48},"01:36:53","00:15:05","00:06:28",3]
["M4",10,"NOGENT SUR MARNE CN 2","CN2","Christophe RUCKEBUSCH-Nicolas BURCKHART-Alice GHEERBRANT-Aurelie DONVAL-Gerard LECA",{"$f":"VLOOKUP(B22,Equipes!A:J,2,FALSE)","v":"M"},{"$f":"ROUND(VLOOKUP(B22,Equipes!$A$2:$J$41,10,0),0)","v":53},"01:36:54","00:15:06","00:06:29",4]
["M5",13,"PORT-MARLY RC 2","RCPM2","Elsa CROZATIER-Cyrielle BERTHIER-Hervé Valette-Eric MOINARD-Anais FEUGA",{"$f":"VLOOKUP(B23,Equipes!A:J,2,FALSE)","v":"M"},{"$f":"ROUND(VLOOKUP(B23,Equipes!$A$2:$J$41,10,0),0)","v":47},"01:36:59","00:15:11","00:06:34",5]
["M6",20,"ROUEN CNAR 1","CNAR1","Nathalie MOUSSET-Francois LAIR-Betty GESLAIN-Thierry DUCHESNE-Stephane MOUSSET",{"$f":"VLOOKUP(B24,Equipes!A:J,2,FALSE)","v":"M"},{"$f":"ROUND(VLOOKUP(B24,Equipes!$A$2:$J$41,10,0),0)","v":55},"01:37:13","00:15:25","00:06:48",6]
["M7",25,"VILLENNES - POISSY AC 2","ACVP2","Franck CARIOU-Michael LE BANNER-Valerie DECAESTECKER-Karine GUILBON-Christophe ELINE",{"$f":"VLOOKUP(B25,Equipes!A:J,2,FALSE)","v":"M"},{"$f":"ROUND(VLOOKUP(B25,Equipes!$A$2:$J$41,10,0),0)","v":54},"01:38:27","00:16:39","00:08:02",7]
["M8",6,"BOULOGNE 92 2","ACBB","CéLia ROUSSELLE-Marie Pierre MARSALLON GAMBY-Françis ROBIN-Nicolas LECOEUR-Theodora XENOGIANI",{"$f":"VLOOKUP(B26,Equipes!A:J,2,FALSE)","v":"M"},{"$f":"ROUND(VLOOKUP(B26,Equipes!$A$2:$J$41,10,0),0)","v":46},"01:39:43","00:17:55","00:09:18",8]
["M9",7,"VILLENNES - POISSY AC 3","ACVP","Virginie ALEXANDRE-Jihad LEMARQRI-Cyrille BRUZON-BASCOU-Sebastien CARPENTIER-Marie Estelle D'ARBAUMONT",{"$f":"VLOOKUP(B27,Equipes!A:J,2,FALSE)","v":"M"},{"$f":"ROUND(VLOOKUP(B27,Equipes!$A$2:$J$41,10,0),0)","v":49},"01:41:29","00:19:41","00:11:04",9]
["M10",14,"MAISONS MESNIL CERAMM 1","CERAMM1","Nicolas SCHMITT-Gloria VENDRELL-Christine MARIE LAVAUD-Amaury DE LA LAURENCIE-Amina ELABBADI",{"$f":"VLOOKUP(B28,Equipes!A:J,2,FALSE)","v":"M"},{"$f":"ROUND(VLOOKUP(B28,Equipes!$A$2:$J$41,10,0),0)","v":50},"01:42:15","00:20:27","00:11:50",10]
["M11",9,"NOGENT SUR MARNE CN 1","CN 1","Chrystelle SUPIOT-Caroline PIEDNOIRE-Olivier MUCIGNAT-Andre SIMONNET-Fabienne LORTIE",{"$f":"VLOOKUP(B29,Equipes!A:J,2,FALSE)","v":"M"},{"$f":"ROUND(VLOOKUP(B29,Equipes!$A$2:$J$41,10,0),0)","v":53},"01:43:36","00:21:48","00:13:11",11]
["M12",2,"CAUDEBEC EN CAUX ACVS 1","Caudebec","Martine NARBAIS-JAUREGUY-Caroline KERVRANN-Stephane DELAMARE-Nicolas BARRAY-Francois NARBAIS-JAUREGUY",{"$f":"VLOOKUP(B30,Equipes!A:J,2,FALSE)","v":"M"},{"$f":"ROUND(VLOOKUP(B30,Equipes!$A$2:$J$41,10,0),0)","v":55},"01:43:47","00:21:59","00:13:22",12]
["M13",26,"EVRY SCA 1","SCA 1","Anne CARDUNER-Olivia PEZZOLI-Bruno CASIMIR-Lionel BOISSONNAT-Kristell MAUCHET",{"$f":"VLOOKUP(B31,Equipes!A:J,2,FALSE)","v":"M"},{"$f":"ROUND(VLOOKUP(B31,Equipes!$A$2:$J$41,10,0),0)","v":56},"01:46:30","00:24:42","00:16:05",13]
["M14",5,"PORT-MARLY RC 1","RCPM","Claudie BODIN-Fanny LAMOUR-Etienne DUPUIS-Jeancharles FAUCHEUX-Gildas KETTANJIAN",{"$f":"VLOOKUP(B32,Equipes!A:J,2,FALSE)","v":"M"},{"$f":"ROUND(VLOOKUP(B32,Equipes!$A$2:$J$41,10,0),0)","v":50},"01:49:12","00:27:24","00:18:47",14]
["M15",23,"SN OISE 1","SN Oise 1\n","Agnes AUDEBERT-Nicolas RAUCH-Jerome ROUGE-Nathalie BAUDIER-Isabelle JOUBERT",{"$f":"VLOOKUP(B33,Equipes!A:J,2,FALSE)","v":"M"},{"$f":"ROUND(VLOOKUP(B33,Equipes!$A$2:$J$41,10,0),0)","v":50},"01:53:02","00:31:14","00:22:37",15]
["M16",31,"NOGENT SUR MARNE CN 3","CN3","Alexandra COHEN SALMON-Isabelle MILON-BANNEROT-Jerome TROMBOFSKY-Olivier PASCAL-Elisabeth LAUNAY",{"$f":"VLOOKUP(B34,Equipes!A:J,2,FALSE)","v":"M"},{"$f":"ROUND(VLOOKUP(B34,Equipes!$A$2:$J$41,10,0),0)","v":53},"01:56:47","00:34:59","00:26:22",16]
["M17",1,"ANDRESY CA CONFLUENT 1","Cac1","Stephanie LAPORTE-Marine NACERI-Marc LACCASSAGNE-Stephane ZETTWOOG-Fouzia VOIRIN",{"$f":"VLOOKUP(B35,Equipes!A:J,2,FALSE)","v":"M"},{"$f":"ROUND(VLOOKUP(B35,Equipes!$A$2:$J$41,10,0),0)","v":49},"01:56:53","00:35:05","00:26:28",17]
["M18",3,"ANDRESY CA CONFLUENT 2","CAC 2","Anna ALCALOIDEPOIXBLANC-Geoffrey GHIZZONI-Nathalie BOURGEOIS-Franck CHRISTIANNOT-NicOLAS delaunoy",{"$f":"VLOOKUP(B36,Equipes!A:J,2,FALSE)","v":"M"},{"$f":"ROUND(VLOOKUP(B36,Equipes!$A$2:$J$41,10,0),0)","v":55},"01:57:49","00:36:01","00:27:24",18]
["X1",33,"XX","XX","XX-XX-XX-XX-XX",{"$f":"VLOOKUP(B37,Equipes!A:J,2,FALSE)","v":"X"},{"$f":"ROUND(VLOOKUP(B37,Equipes!$A$2:$J$41,10,0),0)","v":0},"99:99:99",{"$error":"#VALUE!"},{"$error":"#VALUE!"},1]
["X2",34,"XX","XX","XX-XX-XX-XX-XX",{"$f":"VLOOKUP(B38,Equipes!A:J,2,FALSE)","v":"X"},{"$f":"ROUND(VLOOKUP(B38,Equipes!$A$2:$J$41,10,0),0)","v":0},"99:99:99",{"$error":"#VALUE!"},{"$error":"#VALUE!"},2]
["X3",35,"XX","XX","XX-XX-XX-XX-XX",{"$f":"VLOOKUP(B39,Equipes!A:J,2,FALSE)","v":"X"},{"$f":"ROUND(VLOOKUP(B39,Equipes!$A$2:$J$41,10,0),0)","v":0},"99:99:99",{"$error":"#VALUE!"},{"$error":"#VALUE!"},3]
["X4",36,"XX","XX","XX-XX-XX-XX-XX",{"$f":"VLOOKUP(B40,Equipes!A:J,2,FALSE)","v":"X"},{"$f":"ROUND(VLOOKUP(B40,Equipes!$A$2:$J$41,10,0),0)","v":0},"99:99:99",{"$error":"#VALUE!"},{"$error":"#VALUE!"},4]
["X5",37,"XX","XX","XX-XX-XX-XX-XX",{"$f":"VLOOKUP(B41,Equipes!A:J,2,FALSE)","v":"X"},{"$f":"ROUND(VLOOKUP(B41,Equipes!$A$2:$J$41,10,0),0)","v":0},"99:99:99",{"$error":"#VALUE!"},{"$error":"#VALUE!"},5]
["X6",38,"XX","XX","XX-XX-XX-XX-XX",{"$f":"VLOOKUP(B42,Equipes!A:J,2,FALSE)","v":"X"},{"$f":"ROUND(VLOOKUP(B42,Equipes!$A$2:$J$41,10,0),0)","v":0},"99:99:99",{"$error":"#VALUE!"},{"$error":"#VALUE!"},6]
["1",39,"XX","XX","XX-XX-XX-XX-XX",null,null,"99:99:99",{"$error":"#VALUE!"},{"$error":"#VALUE!"},1]
["2",40,"XX","XX","XX-XX-XX-XX-XX",null,null,"99:99:99",{"$error":"#VALUE!"},{"$error":"#VALUE!"},2]

{"sheet":"CL GENERAL","index":21,"n_rows":44,"n_cols":12,"rows_kept":44,"cut":false,"hidden":false,"merged":[[7,14,8,14],[0,6,1,10],[0,0,1,3],[0,4,1,5]]}
["GRAND HUIT",null,null,null,{"$f":"'Note explicative fichier'!E3","v":"2024-06-02"},null,"CLASSEMENT GENERAL"]
[]
["Yolette N°","Club","Ville","Equipage ","Cat.","Age Moyen","Arrivée\nG-8","Ecart record","Ecart 1er N","Position","Position par cat."]
["Record",{"$f":"'Temps corr'!B4","v":"POLYTECHNIQUE ( Référence 2012 )"},{"$f":"'Temps corr'!C4","v":"Palaiseau"},{"$f":"'Temps corr'!D4","v":"FERRERO Michel - Alexandre Rosinski - BOYAUD Mathieu - GODDE Olivier - THECKES Benoit"},null,null,{"$f":"'Temps corr'!L4","v":"01:21:48"},null,{"$f":"MIN(G5:G44)","v":"01:30:25"}]
[16,"PORT-MARLY RC 1","RCPM1","Jean-Claude LAFOREST-David CHARTIER-Christophe MARCAIS-Vincent BONTOUX-Alain ROUSSEAU",{"$f":"VLOOKUP(A5,Equipes!A:J,2,FALSE)","v":"H"},{"$f":"ROUND(VLOOKUP(A5,Equipes!$A$2:$J$41,10,0),0)","v":55},"01:30:25",{"$f":"IF(G5<\"99:99:99\",G5-$G$4,\"\")","v":"00:08:37"},{"$f":"IF(G5<\"99:99:99\",G5-$I$4,\"\")","v":"00:00:00"},1,{"$f":"VLOOKUP(A5,'Cl Catégories'!B:K,10,0)","v":1},{"$f":"IF(G5=G4,\"ExAequo\",\"\")","v":""}]
[28,"VILLENNES - POISSY AC 1","ACVP1","Frederic LE ROUX-Corinne HUARD-ROLLAND-Elodie DEREMIENCE-Marie-Claude LAUNAY-Olivier COSNEAU",{"$f":"VLOOKUP(A6,Equipes!A:J,2,FALSE)","v":"M"},{"$f":"ROUND(VLOOKUP(A6,Equipes!$A$2:$J$41,10,0),0)","v":53},"01:31:07",{"$f":"IF(G6<\"99:99:99\",G6-$G$4,\"\")","v":"00:09:19"},{"$f":"IF(G6<\"99:99:99\",G6-$I$4,\"\")","v":"00:00:42"},2,{"$f":"VLOOKUP(A6,'Cl Catégories'!B:K,10,0)","v":1},""]
[21,"PORT-MARLY RC 2","RCPM2","Guillaume CHARRON-Philippe VERHE-Stephan REYNIER-Dominique LEROUX-Luciano AUTUNNALE",{"$f":"VLOOKUP(A7,Equipes!A:J,2,FALSE)","v":"H"},{"$f":"ROUND(VLOOKUP(A7,Equipes!$A$2:$J$41,10,0),0)","v":51},"01:31:40","00:09:52","00:01:15",3,{"$f":"VLOOKUP(A7,'Cl Catégories'!B:K,10,0)","v":2},""]
[8,"JOINVILLE AMJ 1","Joinville","Laurent BAUDOIN-Raphaelle BOUVIER FLORY-Sophie BUSTOS-Kastriot JAKA-Thomas AUGER",{"$f":"VLOOKUP(A8,Equipes!A:J,2,FALSE)","v":"M"},{"$f":"ROUND(VLOOKUP(A8,Equipes!$A$2:$J$41,10,0),0)","v":46},"01:33:32","00:11:44","00:03:07",4,{"$f":"VLOOKUP(A8,'Cl Catégories'!B:K,10,0)","v":2},""]
[24,"MEULAN LES MUREAUX AMMH 1","AMMH1","Xavier MARSAIS-Eric PRENEY-Yannick DAGMEY-David COINE-Arthur VAN SLOOTEN",{"$f":"VLOOKUP(A9,Equipes!A:J,2,FALSE)","v":"H"},{"$f":"ROUND(VLOOKUP(A9,Equipes!$A$2:$J$41,10,0),0)","v":53},"01:36:04","00:14:16","00:05:39",5,{"$f":"VLOOKUP(A9,'Cl Catégories'!B:K,10,0)","v":3},""]
[12,"EVRY SCA 2","SCA2","Laurent YEBOAH-Isabelle MOISSET FLEURISSON-Frederic DUCAUQUY-Sandrine GARCIA-Christelle MARTIN",{"$f":"VLOOKUP(A10,Equipes!A:J,2,FALSE)","v":"M"},{"$f":"ROUND(VLOOKUP(A10,Equipes!$A$2:$J$41,10,0),0)","v":48},"01:36:53","00:15:05","00:06:28",6,{"$f":"VLOOKUP(A10,'Cl Catégories'!B:K,10,0)","v":3},""]
[10,"NOGENT SUR MARNE CN 2","CN2","Christophe RUCKEBUSCH-Nicolas BURCKHART-Alice GHEERBRANT-Aurelie DONVAL-Gerard LECA",{"$f":"VLOOKUP(A11,Equipes!A:J,2,FALSE)","v":"M"},{"$f":"ROUND(VLOOKUP(A11,Equipes!$A$2:$J$41,10,0),0)","v":53},"01:36:54","00:15:06","00:06:29",7,{"$f":"VLOOKUP(A11,'Cl Catégories'!B:K,10,0)","v":4},""]
[13,"PORT-MARLY RC 2","RCPM2","Elsa CROZATIER-Cyrielle BERTHIER-Hervé Valette-Eric MOINARD-Anais FEUGA",{"$f":"VLOOKUP(A12,Equipes!A:J,2,FALSE)","v":"M"},{"$f":"ROUND(VLOOKUP(A12,Equipes!$A$2:$J$41,10,0),0)","v":47},"01:36:59","00:15:11","00:06:34",8,{"$f":"VLOOKUP(A12,'Cl Catégories'!B:K,10,0)","v":5},""]
[20,"ROUEN CNAR 1","CNAR1","Nathalie MOUSSET-Francois LAIR-Betty GESLAIN-Thierry DUCHESNE-Stephane MOUSSET",{"$f":"VLOOKUP(A13,Equipes!A:J,2,FALSE)","v":"M"},{"$f":"ROUND(VLOOKUP(A13,Equipes!$A$2:$J$41,10,0),0)","v":55},"01:37:13","00:15:25","00:06:48",9,{"$f":"VLOOKUP(A13,'Cl Catégories'!B:K,10,0)","v":6},""]
[25,"VILLENNES - POISSY AC 2","ACVP2","Franck CARIOU-Michael LE BANNER-Valerie DECAESTECKER-Karine GUILBON-Christophe ELINE",{"$f":"VLOOKUP(A14,Equipes!A:J,2,FALSE)","v":"M"},{"$f":"ROUND(VLOOKUP(A14,Equipes!$A$2:$J$41,10,0),0)","v":54},"01:38:27","00:16:39","00:08:02",10,{"$f":"VLOOKUP(A14,'Cl Catégories'!B:K,10,0)","v":7},""]
[15,"SOISY SUR SEINE CN 1","CN1","Bertrand PIOGER-Bruno PERIQUOI-Servane BERTRAND-Alain BERNARD-Robert TRAUET",{"$f":"VLOOKUP(A15,Equipes!A:J,2,FALSE)","v":"H"},{"$f":"ROUND(VLOOKUP(A15,Equipes!$A$2:$J$41,10,0),0)","v":54},"01:39:08","00:17:20","00:08:43",11,{"$f":"VLOOKUP(A15,'Cl Catégories'!B:K,10,0)","v":4},""]
[6,"BOULOGNE 92 2","ACBB","CéLia ROUSSELLE-Marie Pierre MARSALLON GAMBY-Françis ROBIN-Nicolas LECOEUR-Theodora XENOGIANI",{"$f":"VLOOKUP(A16,Equipes!A:J,2,FALSE)","v":"M"},{"$f":"ROUND(VLOOKUP(A16,Equipes!$A$2:$J$41,10,0),0)","v":46},"01:39:43","00:17:55","00:09:18",12,{"$f":"VLOOKUP(A16,'Cl Catégories'!B:K,10,0)","v":8},""]
[19,"VILLENNES - POISSY AC 1","ACVP1","Olivier POLGE-Odile POLGE-Laurent BONHOMMET-Antoine VOLPI-Philippe STROHM",{"$f":"VLOOKUP(A17,Equipes!A:J,2,FALSE)","v":"H"},{"$f":"ROUND(VLOOKUP(A17,Equipes!$A$2:$J$41,10,0),0)","v":55},"01:40:56","00:19:08","00:10:31",13,{"$f":"VLOOKUP(A17,'Cl Catégories'!B:K,10,0)","v":5},""]
[30,"JOINVILLE AMJ 1","AMJ1","Vincent FABIEN-Arnaud PUPPO-Jonathan ROOKE-Xavier SUCHET-Nicolas JAMAULT",{"$f":"VLOOKUP(A18,Equipes!A:J,2,FALSE)","v":"H"},{"$f":"ROUND(VLOOKUP(A18,Equipes!$A$2:$J$41,10,0),0)","v":51},"01:41:06","00:19:18","00:10:41",14,{"$f":"VLOOKUP(A18,'Cl Catégories'!B:K,10,0)","v":6},""]
[7,"VILLENNES - POISSY AC 3","ACVP","Virginie ALEXANDRE-Jihad LEMARQRI-Cyrille BRUZON-BASCOU-Sebastien CARPENTIER-Marie Estelle D'ARBAUMONT",{"$f":"VLOOKUP(A19,Equipes!A:J,2,FALSE)","v":"M"},{"$f":"ROUND(VLOOKUP(A19,Equipes!$A$2:$J$41,10,0),0)","v":49},"01:41:29","00:19:41","00:11:04",15,{"$f":"VLOOKUP(A19,'Cl Catégories'!B:K,10,0)","v":9},""]
[18,"MAISONS MESNIL CERAMM 2","CERAMM2","Claude LEMENAGER-Didier GIRARDEAU-Laurent LIBOTTE-Alain GIRARD-Cecile JEAMMES",{"$f":"VLOOKUP(A20,Equipes!A:J,2,FALSE)","v":"H"},{"$f":"ROUND(VLOOKUP(A20,Equipes!$A$2:$J$41,10,0),0)","v":58},"01:41:38","00:19:50","00:11:13",16,{"$f":"VLOOKUP(A20,'Cl Catégories'!B:K,10,0)","v":7},""]
[22,"COUDRAY MONTCEAUX A 1","coudray1","Joseph RAYNAUD-Frederic MORAT-Benjamin HOUILLON-Pascal BEAUSSART-Anne HOUAL",{"$f":"VLOOKUP(A21,Equipes!A:J,2,FALSE)","v":"H"},{"$f":"ROUND(VLOOKUP(A21,Equipes!$A$2:$J$41,10,0),0)","v":52},"01:41:46",{"$f":"IF(G21<\"99:99:99\",G21-$G$4,\"\")","v":"00:19:58"},"00:11:21",17,{"$f":"VLOOKUP(A21,'Cl Catégories'!B:K,10,0)","v":8},""]
[14,"MAISONS MESNIL CERAMM 1","CERAMM1","Nicolas SCHMITT-Gloria VENDRELL-Christine MARIE LAVAUD-Amaury DE LA LAURENCIE-Amina ELABBADI",{"$f":"VLOOKUP(A22,Equipes!A:J,2,FALSE)","v":"M"},{"$f":"ROUND(VLOOKUP(A22,Equipes!$A$2:$J$41,10,0),0)","v":50},"01:42:15",{"$f":"IF(G22<\"99:99:99\",G22-$G$4,\"\")","v":"00:20:27"},"00:11:50",18,{"$f":"VLOOKUP(A22,'Cl Catégories'!B:K,10,0)","v":10},""]
[9,"NOGENT SUR MARNE CN 1","CN 1","Chrystelle SUPIOT-Caroline PIEDNOIRE-Olivier MUCIGNAT-Andre SIMONNET-Fabienne LORTIE",{"$f":"VLOOKUP(A23,Equipes!A:J,2,FALSE)","v":"M"},{"$f":"ROUND(VLOOKUP(A23,Equipes!$A$2:$J$41,10,0),0)","v":53},"01:43:36",{"$f":"IF(G23<\"99:99:99\",G23-$G$4,\"\")","v":"00:21:48"},"00:13:11",19,{"$f":"VLOOKUP(A23,'Cl Catégories'!B:K,10,0)","v":11},""]
[2,"CAUDEBEC EN CAUX ACVS 1","Caudebec","Martine NARBAIS-JAUREGUY-Caroline KERVRANN-Stephane DELAMARE-Nicolas BARRAY-Francois NARBAIS-JAUREGUY",{"$f":"VLOOKUP(A24,Equipes!A:J,2,FALSE)","v":"M"},{"$f":"ROUND(VLOOKUP(A24,Equipes!$A$2:$J$41,10,0),0)","v":55},"01:43:47",{"$f":"IF(G24<\"99:99:99\",G24-$G$4,\"\")","v":"00:21:59"},"00:13:22",20,{"$f":"VLOOKUP(A24,'Cl Catégories'!B:K,10,0)","v":12},{"$f":"IF(G24=G23,\"ExAequo\",\"\")","v":""}]
[26,"EVRY SCA 1","SCA 1","Anne CARDUNER-Olivia PEZZOLI-Bruno CASIMIR-Lionel BOISSONNAT-Kristell MAUCHET",{"$f":"VLOOKUP(A25,Equipes!A:J,2,FALSE)","v":"M"},{"$f":"ROUND(VLOOKUP(A25,Equipes!$A$2:$J$41,10,0),0)","v":56},"01:46:30","00:24:42","00:16:05",21,{"$f":"VLOOKUP(A25,'Cl Catégories'!B:K,10,0)","v":13},{"$f":"IF(G25=G24,\"ExAequo\",\"\")","v":""}]
[4,"ANDRESY CA CONFLUENT 1","CAC3","Emmanuel SALIN-Ousseni PARKOUDA-Jean-Baptiste PROVENZANO-Jerome CLAVE-Julian GALLELA",{"$f":"VLOOKUP(A26,Equipes!A:J,2,FALSE)","v":"H"},{"$f":"ROUND(VLOOKUP(A26,Equipes!$A$2:$J$41,10,0),0)","v":46},"01:47:27","00:25:39","00:17:02",22,{"$f":"VLOOKUP(A26,'Cl Catégories'!B:K,10,0)","v":9},""]
[29,"FONTAINEBLEAU APF 1","APF1","Kathleen SANCHEZ-Laurent FOUQUE-Christian MESSALES-Denis FLORY-David WEBER",{"$f":"VLOOKUP(A27,Equipes!A:J,2,FALSE)","v":"H"},{"$f":"ROUND(VLOOKUP(A27,Equipes!$A$2:$J$41,10,0),0)","v":57},"01:48:05","00:26:17","00:17:40",23,{"$f":"VLOOKUP(A27,'Cl Catégories'!B:K,10,0)","v":10},""]
[5,"PORT-MARLY RC 1","RCPM","Claudie BODIN-Fanny LAMOUR-Etienne DUPUIS-Jeancharles FAUCHEUX-Gildas KETTANJIAN",{"$f":"VLOOKUP(A28,Equipes!A:J,2,FALSE)","v":"M"},{"$f":"ROUND(VLOOKUP(A28,Equipes!$A$2:$J$41,10,0),0)","v":50},"01:49:12","00:27:24","00:18:47",24,{"$f":"VLOOKUP(A28,'Cl Catégories'!B:K,10,0)","v":14},""]
[11,"BOULOGNE 92 1","ACBB","Viviane BALLOY-Timothé BAZIRIES-Alexandre LE FUR-Sigrid PABST-Michel VEDRINE",{"$f":"VLOOKUP(A29,Equipes!A:J,2,FALSE)","v":"H"},{"$f":"ROUND(VLOOKUP(A29,Equipes!$A$2:$J$41,10,0),0)","v":51},"01:50:55","00:29:07","00:20:30",25,{"$f":"VLOOKUP(A29,'Cl Catégories'!B:K,10,0)","v":11},""]
[23,"SN OISE 1","SN Oise 1\n","Agnes AUDEBERT-Nicolas RAUCH-Jerome ROUGE-Nathalie BAUDIER-Isabelle JOUBERT",{"$f":"VLOOKUP(A30,Equipes!A:J,2,FALSE)","v":"M"},{"$f":"ROUND(VLOOKUP(A30,Equipes!$A$2:$J$41,10,0),0)","v":50},"01:53:02","00:31:14","00:22:37",26,{"$f":"VLOOKUP(A30,'Cl Catégories'!B:K,10,0)","v":15},""]
[31,"NOGENT SUR MARNE CN 3","CN3","Alexandra COHEN SALMON-Isabelle MILON-BANNEROT-Jerome TROMBOFSKY-Olivier PASCAL-Elisabeth LAUNAY",{"$f":"VLOOKUP(A31,Equipes!A:J,2,FALSE)","v":"M"},{"$f":"ROUND(VLOOKUP(A31,Equipes!$A$2:$J$41,10,0),0)","v":53},"01:56:47","00:34:59","00:26:22",27,{"$f":"VLOOKUP(A31,'Cl Catégories'!B:K,10,0)","v":16},""]
[1,"ANDRESY CA CONFLUENT 1","Cac1","Stephanie LAPORTE-Marine NACERI-Marc LACCASSAGNE-Stephane ZETTWOOG-Fouzia VOIRIN",{"$f":"VLOOKUP(A32,Equipes!A:J,2,FALSE)","v":"M"},{"$f":"ROUND(VLOOKUP(A32,Equipes!$A$2:$J$41,10,0),0)","v":49},"01:56:53","00:35:05","00:26:28",28,{"$f":"VLOOKUP(A32,'Cl Catégories'!B:K,10,0)","v":17},""]
[3,"ANDRESY CA CONFLUENT 2","CAC 2","Anna ALCALOIDEPOIXBLANC-Geoffrey GHIZZONI-Nathalie BOURGEOIS-Franck CHRISTIANNOT-NicOLAS delaunoy",{"$f":"VLOOKUP(A33,Equipes!A:J,2,FALSE)","v":"M"},{"$f":"ROUND(VLOOKUP(A33,Equipes!$A$2:$J$41,10,0),0)","v":55},"01:57:49","00:36:01","00:27:24",29,{"$f":"VLOOKUP(A33,'Cl Catégories'!B:K,10,0)","v":18},""]
[27,"MEULAN LES MUREAUX AMMH 1","AMMH1","Gwenaelle MARSAIS-Sophie SEFFAR-Catherine MARTINIER-Christelle GOANVIC-Marie LAMORE",{"$f":"VLOOKUP(A34,Equipes!A:J,2,FALSE)","v":"F"},{"$f":"ROUND(VLOOKUP(A34,Equipes!$A$2:$J$41,10,0),0)","v":47},"01:59:47","00:37:59","00:29:22",30,{"$f":"VLOOKUP(A34,'Cl Catégories'!B:K,10,0)","v":1},""]
[17,"ANDRESY CA CONFLUENT 1","CAC1","Daphne PARIZOT-Agnes BURGHGRAEVE SELLEN-Sylvie FRANSSEN-Severine LEGAILLARD-Martine LE ROUX",{"$f":"VLOOKUP(A35,Equipes!A:J,2,FALSE)","v":"F"},{"$f":"ROUND(VLOOKUP(A35,Equipes!$A$2:$J$41,10,0),0)","v":55},"02:01:10","00:39:22","00:30:45",31,{"$f":"VLOOKUP(A35,'Cl Catégories'!B:K,10,0)","v":2},""]
[32,"BOULOGNE 92 1","ACBB1","Isabelle MAIRE-Théo BEL BERBEL- LURBE-Thã‰Odore SEDAROS-Omar OUAZZANI-Alexandra MENEZES",{"$f":"VLOOKUP(A36,Equipes!A:J,2,FALSE)","v":"H"},{"$f":"ROUND(VLOOKUP(A36,Equipes!$A$2:$J$41,10,0),0)","v":43},"99:99:99","","",32,{"$f":"VLOOKUP(A36,'Cl Catégories'!B:K,10,0)","v":12},""]
[33,"XX","XX","XX-XX-XX-XX-XX",{"$f":"VLOOKUP(A37,Equipes!A:J,2,FALSE)","v":"X"},{"$f":"ROUND(VLOOKUP(A37,Equipes!$A$2:$J$41,10,0),0)","v":0},"99:99:99","","",33,{"$f":"VLOOKUP(A37,'Cl Catégories'!B:K,10,0)","v":1},"ExAequo"]
[34,"XX","XX","XX-XX-XX-XX-XX",{"$f":"VLOOKUP(A38,Equipes!A:J,2,FALSE)","v":"X"},{"$f":"ROUND(VLOOKUP(A38,Equipes!$A$2:$J$41,10,0),0)","v":0},"99:99:99","","",34,{"$f":"VLOOKUP(A38,'Cl Catégories'!B:K,10,0)","v":2},"ExAequo"]
[35,"XX","XX","XX-XX-XX-XX-XX",{"$f":"VLOOKUP(A39,Equipes!A:J,2,FALSE)","v":"X"},{"$f":"ROUND(VLOOKUP(A39,Equipes!$A$2:$J$41,10,0),0)","v":0},"99:99:99","","",35,{"$f":"VLOOKUP(A39,'Cl Catégories'!B:K,10,0)","v":3},"ExAequo"]
[36,"XX","XX","XX-XX-XX-XX-XX",{"$f":"VLOOKUP(A40,Equipes!A:J,2,FALSE)","v":"X"},{"$f":"ROUND(VLOOKUP(A40,Equipes!$A$2:$J$41,10,0),0)","v":0},"99:99:99","","",36,{"$f":"VLOOKUP(A40,'Cl Catégories'!B:K,10,0)","v":4},"ExAequo"]
[37,"XX","XX","XX-XX-XX-XX-XX",{"$f":"VLOOKUP(A41,Equipes!A:J,2,FALSE)","v":"X"},{"$f":"ROUND(VLOOKUP(A41,Equipes!$A$2:$J$41,10,0),0)","v":0},"99:99:99","","",37,{"$f":"VLOOKUP(A41,'Cl Catégories'!B:K,10,0)","v":5},"ExAequo"]
[38,"XX","XX","XX-XX-XX-XX-XX",{"$f":"VLOOKUP(A42,Equipes!A:J,2,FALSE)","v":"X"},{"$f":"ROUND(VLOOKUP(A42,Equipes!$A$2:$J$41,10,0),0)","v":0},"99:99:99","","",38,{"$f":"VLOOKUP(A42,'Cl Catégories'!B:K,10,0)","v":6},"ExAequo"]
[39,"XX","XX","XX-XX-XX-XX-XX",{"$f":"VLOOKUP(A43,Equipes!A:J,2,FALSE)","v":"X"},{"$f":"ROUND(VLOOKUP(A43,Equipes!$A$2:$J$41,10,0),0)","v":0},"99:99:99","","",39,{"$f":"VLOOKUP(A43,'Cl Catégories'!B:K,10,0)","v":1},"ExAequo"]
[40,"XX","XX","XX-XX-XX-XX-XX",{"$f":"VLOOKUP(A44,Equipes!A:J,2,FALSE)","v":"X"},{"$f":"ROUND(VLOOKUP(A44,Equipes!$A$2:$J$41,10,0),0)","v":0},"99:99:99","","",40,{"$f":"VLOOKUP(A44,'Cl Catégories'!B:K,10,0)","v":2},"ExAequo"]

{"sheet":"Cl Slalom","index":22,"n_rows":44,"n_cols":16,"rows_kept":44,"cut":false,"hidden":false,"merged":[[0,6,1,9],[0,4,1,5],[0,0,1,3]]}
["GRAND HUIT",null,null,null,{"$f":"'Note explicative fichier'!E3","v":"2024-06-02"},null,"CLASSEMENT AU SLALOM"]
[]
["Yolette N°","Club","Ville","Equipage ",null,null,"SLALOM1","SLALOM2","TEMPS MOYEN","CLASSEMENT"]
[{"$f":"'Temps corr'!A4","v":"Record"},{"$f":"'Temps corr'!B4","v":"POLYTECHNIQUE ( Référence 2012 )"},{"$f":"'Temps corr'!C4","v":"Palaiseau"},{"$f":"'Temps corr'!D4","v":"FERRERO Michel - Alexandre Rosinski - BOYAUD Mathieu - GODDE Olivier - THECKES Benoit"}]
[1,"ANDRESY CA CONFLUENT 1","Cac1","Stephanie LAPORTE-Marine NACERI-Marc LACCASSAGNE-Stephane ZETTWOOG-Fouzia VOIRIN",{"$f":"VLOOKUP(A5,Equipes!A:J,2,FALSE)","v":"M"},{"$f":"ROUND(VLOOKUP(A5,Equipes!$A$2:$J$41,10,0),0)","v":49},"99:99:99","99:99:99",{"$f":"AVERAGE(G5:H5)","v":{"$error":"#DIV/0!"}},{"$f":"IF(B5=\"ACVP\",\"HC\",N5)","v":1},16,16,{"$f":"IF(B5=\"ACVP\",0,1)","v":1},{"$f":"M5","v":1},{"$f":"CONCATENATE(\"S\",N5)","v":"S1"},{"$f":"A5","v":1}]
[2,"CAUDEBEC EN CAUX ACVS 1","Caudebec","Martine NARBAIS-JAUREGUY-Caroline KERVRANN-Stephane DELAMARE-Nicolas BARRAY-Francois NARBAIS-JAUREGUY",{"$f":"VLOOKUP(A6,Equipes!A:J,2,FALSE)","v":"M"},{"$f":"ROUND(VLOOKUP(A6,Equipes!$A$2:$J$41,10,0),0)","v":55},"99:99:99","99:99:99",{"$error":"#DIV/0!"},{"$f":"IF(B6=\"ACVP\",\"HC\",N6)","v":2},"Ier","Ières",{"$f":"IF(B6=\"ACVP\",0,1)","v":1},{"$f":"M6+N5","v":2},{"$f":"CONCATENATE(\"S\",N6)","v":"S2"},2]
[3,"ANDRESY CA CONFLUENT 2","CAC 2","Anna ALCALOIDEPOIXBLANC-Geoffrey GHIZZONI-Nathalie BOURGEOIS-Franck CHRISTIANNOT-NicOLAS delaunoy",{"$f":"VLOOKUP(A7,Equipes!A:J,2,FALSE)","v":"M"},{"$f":"ROUND(VLOOKUP(A7,Equipes!$A$2:$J$41,10,0),0)","v":55},"99:99:99","99:99:99",{"$error":"#DIV/0!"},3,10,10,1,{"$f":"M7+N6","v":3},"S3",3]
[4,"ANDRESY CA CONFLUENT 1","CAC3","Emmanuel SALIN-Ousseni PARKOUDA-Jean-Baptiste PROVENZANO-Jerome CLAVE-Julian GALLELA",{"$f":"VLOOKUP(A8,Equipes!A:J,2,FALSE)","v":"H"},{"$f":"ROUND(VLOOKUP(A8,Equipes!$A$2:$J$41,10,0),0)","v":46},"99:99:99","99:99:99",{"$error":"#DIV/0!"},4,32,32,1,4,"S4",4]
[5,"PORT-MARLY RC 1","RCPM","Claudie BODIN-Fanny LAMOUR-Etienne DUPUIS-Jeancharles FAUCHEUX-Gildas KETTANJIAN",{"$f":"VLOOKUP(A9,Equipes!A:J,2,FALSE)","v":"M"},{"$f":"ROUND(VLOOKUP(A9,Equipes!$A$2:$J$41,10,0),0)","v":50},"99:99:99","99:99:99",{"$error":"#DIV/0!"},5,31,31,1,5,"S5",5]
[6,"BOULOGNE 92 2","ACBB","CéLia ROUSSELLE-Marie Pierre MARSALLON GAMBY-Françis ROBIN-Nicolas LECOEUR-Theodora XENOGIANI",{"$f":"VLOOKUP(A10,Equipes!A:J,2,FALSE)","v":"M"},{"$f":"ROUND(VLOOKUP(A10,Equipes!$A$2:$J$41,10,0),0)","v":46},"99:99:99","99:99:99",{"$error":"#DIV/0!"},6,6,6,1,6,"S6",6]
[7,"VILLENNES - POISSY AC 3","ACVP","Virginie ALEXANDRE-Jihad LEMARQRI-Cyrille BRUZON-BASCOU-Sebastien CARPENTIER-Marie Estelle D'ARBAUMONT",{"$f":"VLOOKUP(A11,Equipes!A:J,2,FALSE)","v":"M"},{"$f":"ROUND(VLOOKUP(A11,Equipes!$A$2:$J$41,10,0),0)","v":49},"99:99:99","99:99:99",{"$error":"#DIV/0!"},7,23,23,1,7,"S7",7]
[8,"JOINVILLE AMJ 1","Joinville","Laurent BAUDOIN-Raphaelle BOUVIER FLORY-Sophie BUSTOS-Kastriot JAKA-Thomas AUGER",{"$f":"VLOOKUP(A12,Equipes!A:J,2,FALSE)","v":"M"},{"$f":"ROUND(VLOOKUP(A12,Equipes!$A$2:$J$41,10,0),0)","v":46},"99:99:99","99:99:99",{"$error":"#DIV/0!"},8,30,30,1,8,"S8",8]
[9,"NOGENT SUR MARNE CN 1","CN 1","Chrystelle SUPIOT-Caroline PIEDNOIRE-Olivier MUCIGNAT-Andre SIMONNET-Fabienne LORTIE",{"$f":"VLOOKUP(A13,Equipes!A:J,2,FALSE)","v":"M"},{"$f":"ROUND(VLOOKUP(A13,Equipes!$A$2:$J$41,10,0),0)","v":53},"99:99:99","99:99:99",{"$error":"#DIV/0!"},9,8,8,1,9,"S9",9]
[10,"NOGENT SUR MARNE CN 2","CN2","Christophe RUCKEBUSCH-Nicolas BURCKHART-Alice GHEERBRANT-Aurelie DONVAL-Gerard LECA",{"$f":"VLOOKUP(A14,Equipes!A:J,2,FALSE)","v":"M"},{"$f":"ROUND(VLOOKUP(A14,Equipes!$A$2:$J$41,10,0),0)","v":53},"99:99:99","99:99:99",{"$error":"#DIV/0!"},10,17,17,1,10,"S10",10]
[11,"BOULOGNE 92 1","ACBB","Viviane BALLOY-Timothé BAZIRIES-Alexandre LE FUR-Sigrid PABST-Michel VEDRINE",{"$f":"VLOOKUP(A15,Equipes!A:J,2,FALSE)","v":"H"},{"$f":"ROUND(VLOOKUP(A15,Equipes!$A$2:$J$41,10,0),0)","v":51},"99:99:99","99:99:99",{"$error":"#DIV/0!"},11,34,34,1,11,"S11",11]
[12,"EVRY SCA 2","SCA2","Laurent YEBOAH-Isabelle MOISSET FLEURISSON-Frederic DUCAUQUY-Sandrine GARCIA-Christelle MARTIN",{"$f":"VLOOKUP(A16,Equipes!A:J,2,FALSE)","v":"M"},{"$f":"ROUND(VLOOKUP(A16,Equipes!$A$2:$J$41,10,0),0)","v":48},"99:99:99","99:99:99",{"$error":"#DIV/0!"},12,7,7,1,12,"S12",12]
[13,"PORT-MARLY RC 2","RCPM2","Elsa CROZATIER-Cyrielle BERTHIER-Hervé Valette-Eric MOINARD-Anais FEUGA",{"$f":"VLOOKUP(A17,Equipes!A:J,2,FALSE)","v":"M"},{"$f":"ROUND(VLOOKUP(A17,Equipes!$A$2:$J$41,10,0),0)","v":47},"99:99:99","99:99:99",{"$error":"#DIV/0!"},13,9,9,1,13,"S13",13]
[14,"MAISONS MESNIL CERAMM 1","CERAMM1","Nicolas SCHMITT-Gloria VENDRELL-Christine MARIE LAVAUD-Amaury DE LA LAURENCIE-Amina ELABBADI",{"$f":"VLOOKUP(A18,Equipes!A:J,2,FALSE)","v":"M"},{"$f":"ROUND(VLOOKUP(A18,Equipes!$A$2:$J$41,10,0),0)","v":50},"99:99:99","99:99:99",{"$error":"#DIV/0!"},14,21,21,1,14,"S14",14]
[15,"SOISY SUR SEINE CN 1","CN1","Bertrand PIOGER-Bruno PERIQUOI-Servane BERTRAND-Alain BERNARD-Robert TRAUET",{"$f":"VLOOKUP(A19,Equipes!A:J,2,FALSE)","v":"H"},{"$f":"ROUND(VLOOKUP(A19,Equipes!$A$2:$J$41,10,0),0)","v":54},"99:99:99","99:99:99",{"$error":"#DIV/0!"},15,13,13,1,15,"S15",15]
[16,"PORT-MARLY RC 1","RCPM1","Jean-Claude LAFOREST-David CHARTIER-Christophe MARCAIS-Vincent BONTOUX-Alain ROUSSEAU",{"$f":"VLOOKUP(A20,Equipes!A:J,2,FALSE)","v":"H"},{"$f":"ROUND(VLOOKUP(A20,Equipes!$A$2:$J$41,10,0),0)","v":55},"99:99:99","99:99:99",{"$error":"#DIV/0!"},16,25,25,1,16,"S16",16]
[17,"ANDRESY CA CONFLUENT 1","CAC1","Daphne PARIZOT-Agnes BURGHGRAEVE SELLEN-Sylvie FRANSSEN-Severine LEGAILLARD-Martine LE ROUX",{"$f":"VLOOKUP(A21,Equipes!A:J,2,FALSE)","v":"F"},{"$f":"ROUND(VLOOKUP(A21,Equipes!$A$2:$J$41,10,0),0)","v":55},"99:99:99","99:99:99",{"$error":"#DIV/0!"},17,29,29,1,17,"S17",17]
[18,"MAISONS MESNIL CERAMM 2","CERAMM2","Claude LEMENAGER-Didier GIRARDEAU-Laurent LIBOTTE-Alain GIRARD-Cecile JEAMMES",{"$f":"VLOOKUP(A22,Equipes!A:J,2,FALSE)","v":"H"},{"$f":"ROUND(VLOOKUP(A22,Equipes!$A$2:$J$41,10,0),0)","v":58},"99:99:99","99:99:99",{"$error":"#DIV/0!"},18,4,4,1,18,"S18",18]
[19,"VILLENNES - POISSY AC 1","ACVP1","Olivier POLGE-Odile POLGE-Laurent BONHOMMET-Antoine VOLPI-Philippe STROHM",{"$f":"VLOOKUP(A23,Equipes!A:J,2,FALSE)","v":"H"},{"$f":"ROUND(VLOOKUP(A23,Equipes!$A$2:$J$41,10,0),0)","v":55},"99:99:99","99:99:99",{"$error":"#DIV/0!"},19,14,14,1,19,"S19",19]
[20,"ROUEN CNAR 1","CNAR1","Nathalie MOUSSET-Francois LAIR-Betty GESLAIN-Thierry DUCHESNE-Stephane MOUSSET",{"$f":"VLOOKUP(A24,Equipes!A:J,2,FALSE)","v":"M"},{"$f":"ROUND(VLOOKUP(A24,Equipes!$A$2:$J$41,10,0),0)","v":55},"99:99:99","99:99:99",{"$error":"#DIV/0!"},20,22,22,1,20,"S20",20]
[21,"PORT-MARLY RC 2","RCPM2","Guillaume CHARRON-Philippe VERHE-Stephan REYNIER-Dominique LEROUX-Luciano AUTUNNALE",{"$f":"VLOOKUP(A25,Equipes!A:J,2,FALSE)","v":"H"},{"$f":"ROUND(VLOOKUP(A25,Equipes!$A$2:$J$41,10,0),0)","v":51},"99:99:99","99:99:99",{"$error":"#DIV/0!"},21,33,33,1,21,"S21",21]
[22,"COUDRAY MONTCEAUX A 1","coudray1","Joseph RAYNAUD-Frederic MORAT-Benjamin HOUILLON-Pascal BEAUSSART-Anne HOUAL",{"$f":"VLOOKUP(A26,Equipes!A:J,2,FALSE)","v":"H"},{"$f":"ROUND(VLOOKUP(A26,Equipes!$A$2:$J$41,10,0),0)","v":52},"99:99:99","99:99:99",{"$error":"#DIV/0!"},22,3,3,1,22,"S22",22]
[23,"SN OISE 1","SN Oise 1\n","Agnes AUDEBERT-Nicolas RAUCH-Jerome ROUGE-Nathalie BAUDIER-Isabelle JOUBERT",{"$f":"VLOOKUP(A27,Equipes!A:J,2,FALSE)","v":"M"},{"$f":"ROUND(VLOOKUP(A27,Equipes!$A$2:$J$41,10,0),0)","v":50},"99:99:99","99:99:99",{"$error":"#DIV/0!"},23,26,26,1,23,"S23",23]
[24,"MEULAN LES MUREAUX AMMH 1","AMMH1","Xavier MARSAIS-Eric PRENEY-Yannick DAGMEY-David COINE-Arthur VAN SLOOTEN",{"$f":"VLOOKUP(A28,Equipes!A:J,2,FALSE)","v":"H"},{"$f":"ROUND(VLOOKUP(A28,Equipes!$A$2:$J$41,10,0),0)","v":53},"99:99:99","99:99:99",{"$error":"#DIV/0!"},24,20,20,1,24,"S24",24]
[25,"VILLENNES - POISSY AC 2","ACVP2","Franck CARIOU-Michael LE BANNER-Valerie DECAESTECKER-Karine GUILBON-Christophe ELINE",{"$f":"VLOOKUP(A29,Equipes!A:J,2,FALSE)","v":"M"},{"$f":"ROUND(VLOOKUP(A29,Equipes!$A$2:$J$41,10,0),0)","v":54},"99:99:99","99:99:99",{"$error":"#DIV/0!"},25,11,11,1,25,"S25",25]
[26,"EVRY SCA 1","SCA 1","Anne CARDUNER-Olivia PEZZOLI-Bruno CASIMIR-Lionel BOISSONNAT-Kristell MAUCHET",{"$f":"VLOOKUP(A30,Equipes!A:J,2,FALSE)","v":"M"},{"$f":"ROUND(VLOOKUP(A30,Equipes!$A$2:$J$41,10,0),0)","v":56},"99:99:99","99:99:99",{"$error":"#DIV/0!"},26,null,null,1,26,"S26",26]
[27,"MEULAN LES MUREAUX AMMH 1","AMMH1","Gwenaelle MARSAIS-Sophie SEFFAR-Catherine MARTINIER-Christelle GOANVIC-Marie LAMORE",{"$f":"VLOOKUP(A31,Equipes!A:J,2,FALSE)","v":"F"},{"$f":"ROUND(VLOOKUP(A31,Equipes!$A$2:$J$41,10,0),0)","v":47},"99:99:99","99:99:99",{"$error":"#DIV/0!"},27,null,null,1,27,"S27",27]
[28,"VILLENNES - POISSY AC 1","ACVP1","Frederic LE ROUX-Corinne HUARD-ROLLAND-Elodie DEREMIENCE-Marie-Claude LAUNAY-Olivier COSNEAU",{"$f":"VLOOKUP(A32,Equipes!A:J,2,FALSE)","v":"M"},{"$f":"ROUND(VLOOKUP(A32,Equipes!$A$2:$J$41,10,0),0)","v":53},"99:99:99","99:99:99",{"$error":"#DIV/0!"},28,null,null,1,28,"S28",28]
[29,"FONTAINEBLEAU APF 1","APF1","Kathleen SANCHEZ-Laurent FOUQUE-Christian MESSALES-Denis FLORY-David WEBER",{"$f":"VLOOKUP(A33,Equipes!A:J,2,FALSE)","v":"H"},{"$f":"ROUND(VLOOKUP(A33,Equipes!$A$2:$J$41,10,0),0)","v":57},"99:99:99","99:99:99",{"$error":"#DIV/0!"},29,null,null,1,29,"S29",29]
[30,"JOINVILLE AMJ 1","AMJ1","Vincent FABIEN-Arnaud PUPPO-Jonathan ROOKE-Xavier SUCHET-Nicolas JAMAULT",{"$f":"VLOOKUP(A34,Equipes!A:J,2,FALSE)","v":"H"},{"$f":"ROUND(VLOOKUP(A34,Equipes!$A$2:$J$41,10,0),0)","v":51},"99:99:99","99:99:99",{"$error":"#DIV/0!"},30,null,null,1,30,"S30",30]
[31,"NOGENT SUR MARNE CN 3","CN3","Alexandra COHEN SALMON-Isabelle MILON-BANNEROT-Jerome TROMBOFSKY-Olivier PASCAL-Elisabeth LAUNAY",{"$f":"VLOOKUP(A35,Equipes!A:J,2,FALSE)","v":"M"},{"$f":"ROUND(VLOOKUP(A35,Equipes!$A$2:$J$41,10,0),0)","v":53},"99:99:99","99:99:99",{"$error":"#DIV/0!"},31,27,27,1,31,"S31",31]
[32,"BOULOGNE 92 1","ACBB1","Isabelle MAIRE-Théo BEL BERBEL- LURBE-Thã‰Odore SEDAROS-Omar OUAZZANI-Alexandra MENEZES",{"$f":"VLOOKUP(A36,Equipes!A:J,2,FALSE)","v":"H"},{"$f":"ROUND(VLOOKUP(A36,Equipes!$A$2:$J$41,10,0),0)","v":43},"99:99:99","99:99:99",{"$error":"#DIV/0!"},32,15,15,1,32,"S32",32]
[33,"XX","XX","XX-XX-XX-XX-XX",{"$f":"VLOOKUP(A37,Equipes!A:J,2,FALSE)","v":"X"},{"$f":"ROUND(VLOOKUP(A37,Equipes!$A$2:$J$41,10,0),0)","v":0},"99:99:99","99:99:99",{"$error":"#DIV/0!"},33,12,12,1,33,"S33",33]
[34,"XX","XX","XX-XX-XX-XX-XX",{"$f":"VLOOKUP(A38,Equipes!A:J,2,FALSE)","v":"X"},{"$f":"ROUND(VLOOKUP(A38,Equipes!$A$2:$J$41,10,0),0)","v":0},"99:99:99","99:99:99",{"$error":"#DIV/0!"},34,28,28,1,34,"S34",34]
[35,"XX","XX","XX-XX-XX-XX-XX",{"$f":"VLOOKUP(A39,Equipes!A:J,2,FALSE)","v":"X"},{"$f":"ROUND(VLOOKUP(A39,Equipes!$A$2:$J$41,10,0),0)","v":0},"99:99:99","99:99:99",{"$error":"#DIV/0!"},35,null,null,1,35,"S35",35]
[36,"XX","XX","XX-XX-XX-XX-XX",{"$f":"VLOOKUP(A40,Equipes!A:J,2,FALSE)","v":"X"},{"$f":"ROUND(VLOOKUP(A40,Equipes!$A$2:$J$41,10,0),0)","v":0},"99:99:99","99:99:99",{"$error":"#DIV/0!"},36,null,null,1,36,"S36",36]
[37,"XX","XX","XX-XX-XX-XX-XX",{"$f":"VLOOKUP(A41,Equipes!A:J,2,FALSE)","v":"X"},{"$f":"ROUND(VLOOKUP(A41,Equipes!$A$2:$J$41,10,0),0)","v":0},"99:99:99","99:99:99",{"$error":"#DIV/0!"},37,null,null,1,37,"S37",37]
[38,"XX","XX","XX-XX-XX-XX-XX",{"$f":"VLOOKUP(A42,Equipes!A:J,2,FALSE)","v":"X"},{"$f":"ROUND(VLOOKUP(A42,Equipes!$A$2:$J$41,10,0),0)","v":0},"99:99:99","99:99:99",{"$error":"#DIV/0!"},38,null,null,1,38,"S38",38]
[39,"XX","XX","XX-XX-XX-XX-XX",{"$f":"VLOOKUP(A43,Equipes!A:J,2,FALSE)","v":"X"},{"$f":"ROUND(VLOOKUP(A43,Equipes!$A$2:$J$41,10,0),0)","v":0},"99:99:99","99:99:99",{"$error":"#DIV/0!"},39,null,null,1,39,"S39",39]
[40,"XX","XX","XX-XX-XX-XX-XX",{"$f":"VLOOKUP(A44,Equipes!A:J,2,FALSE)","v":"X"},{"$f":"ROUND(VLOOKUP(A44,Equipes!$A$2:$J$41,10,0),0)","v":0},"99:99:99","99:99:99",{"$error":"#DIV/0!"},40,null,null,1,40,"S40",40]

{"sheet":"Temps départ","index":23,"n_rows":44,"n_cols":10,"rows_kept":44,"cut":false,"hidden":false,"merged":[[0,0,1,1],[0,2,1,2],[0,3,1,8],[2,7,3,7]]}
["GRAND HUIT",null,{"$f":"'Note explicative fichier'!E3","v":"2024-06-02"},"Information Temps départ"]
[]
["Yolette N°","Club","Ville","Equipage ","Age Moyen",null,"Temps départ","Classement        (ACVP hors compétition)","CLASSEMENT"]
[null,null,null,null,null,null,"Mise à l'eau=>1er coup de pelle"]
[1,"ANDRESY CA CONFLUENT 1","Cac1","Stephanie LAPORTE-Marine NACERI-Marc LACCASSAGNE-Stephane ZETTWOOG-Fouzia VOIRIN",{"$f":"VLOOKUP(A5,Equipes!A:J,2,FALSE)","v":"M"},{"$f":"ROUND(VLOOKUP(A5,Equipes!$A$2:$J$41,10,0),0)","v":49},"",null,18,18]
[2,"CAUDEBEC EN CAUX ACVS 1","Caudebec","Martine NARBAIS-JAUREGUY-Caroline KERVRANN-Stephane DELAMARE-Nicolas BARRAY-Francois NARBAIS-JAUREGUY",{"$f":"VLOOKUP(A6,Equipes!A:J,2,FALSE)","v":"M"},{"$f":"ROUND(VLOOKUP(A6,Equipes!$A$2:$J$41,10,0),0)","v":55},"",null,16,16]
[3,"ANDRESY CA CONFLUENT 2","CAC 2","Anna ALCALOIDEPOIXBLANC-Geoffrey GHIZZONI-Nathalie BOURGEOIS-Franck CHRISTIANNOT-NicOLAS delaunoy",{"$f":"VLOOKUP(A7,Equipes!A:J,2,FALSE)","v":"M"},{"$f":"ROUND(VLOOKUP(A7,Equipes!$A$2:$J$41,10,0),0)","v":55},"",null,"Ier","Ières"]
[4,"ANDRESY CA CONFLUENT 1","CAC3","Emmanuel SALIN-Ousseni PARKOUDA-Jean-Baptiste PROVENZANO-Jerome CLAVE-Julian GALLELA",{"$f":"VLOOKUP(A8,Equipes!A:J,2,FALSE)","v":"H"},{"$f":"ROUND(VLOOKUP(A8,Equipes!$A$2:$J$41,10,0),0)","v":46},"",null,10,10]
[5,"PORT-MARLY RC 1","RCPM","Claudie BODIN-Fanny LAMOUR-Etienne DUPUIS-Jeancharles FAUCHEUX-Gildas KETTANJIAN",{"$f":"VLOOKUP(A9,Equipes!A:J,2,FALSE)","v":"M"},{"$f":"ROUND(VLOOKUP(A9,Equipes!$A$2:$J$41,10,0),0)","v":50},"",null,32,32]
[6,"BOULOGNE 92 2","ACBB","CéLia ROUSSELLE-Marie Pierre MARSALLON GAMBY-Françis ROBIN-Nicolas LECOEUR-Theodora XENOGIANI",{"$f":"VLOOKUP(A10,Equipes!A:J,2,FALSE)","v":"M"},{"$f":"ROUND(VLOOKUP(A10,Equipes!$A$2:$J$41,10,0),0)","v":46},"",null,31,31]
[7,"VILLENNES - POISSY AC 3","ACVP","Virginie ALEXANDRE-Jihad LEMARQRI-Cyrille BRUZON-BASCOU-Sebastien CARPENTIER-Marie Estelle D'ARBAUMONT",{"$f":"VLOOKUP(A11,Equipes!A:J,2,FALSE)","v":"M"},{"$f":"ROUND(VLOOKUP(A11,Equipes!$A$2:$J$41,10,0),0)","v":49},"",null,6,6]
[8,"JOINVILLE AMJ 1","Joinville","Laurent BAUDOIN-Raphaelle BOUVIER FLORY-Sophie BUSTOS-Kastriot JAKA-Thomas AUGER",{"$f":"VLOOKUP(A12,Equipes!A:J,2,FALSE)","v":"M"},{"$f":"ROUND(VLOOKUP(A12,Equipes!$A$2:$J$41,10,0),0)","v":46},"",null,23,23]
[9,"NOGENT SUR MARNE CN 1","CN 1","Chrystelle SUPIOT-Caroline PIEDNOIRE-Olivier MUCIGNAT-Andre SIMONNET-Fabienne LORTIE",{"$f":"VLOOKUP(A13,Equipes!A:J,2,FALSE)","v":"M"},{"$f":"ROUND(VLOOKUP(A13,Equipes!$A$2:$J$41,10,0),0)","v":53},"",null,30,30]
[10,"NOGENT SUR MARNE CN 2","CN2","Christophe RUCKEBUSCH-Nicolas BURCKHART-Alice GHEERBRANT-Aurelie DONVAL-Gerard LECA",{"$f":"VLOOKUP(A14,Equipes!A:J,2,FALSE)","v":"M"},{"$f":"ROUND(VLOOKUP(A14,Equipes!$A$2:$J$41,10,0),0)","v":53},"",null,8,8]
[11,"BOULOGNE 92 1","ACBB","Viviane BALLOY-Timothé BAZIRIES-Alexandre LE FUR-Sigrid PABST-Michel VEDRINE",{"$f":"VLOOKUP(A15,Equipes!A:J,2,FALSE)","v":"H"},{"$f":"ROUND(VLOOKUP(A15,Equipes!$A$2:$J$41,10,0),0)","v":51},"",null,17,17]
[12,"EVRY SCA 2","SCA2","Laurent YEBOAH-Isabelle MOISSET FLEURISSON-Frederic DUCAUQUY-Sandrine GARCIA-Christelle MARTIN",{"$f":"VLOOKUP(A16,Equipes!A:J,2,FALSE)","v":"M"},{"$f":"ROUND(VLOOKUP(A16,Equipes!$A$2:$J$41,10,0),0)","v":48},"",null,34,34]
[13,"PORT-MARLY RC 2","RCPM2","Elsa CROZATIER-Cyrielle BERTHIER-Hervé Valette-Eric MOINARD-Anais FEUGA",{"$f":"VLOOKUP(A17,Equipes!A:J,2,FALSE)","v":"M"},{"$f":"ROUND(VLOOKUP(A17,Equipes!$A$2:$J$41,10,0),0)","v":47},"",null,7,7]
[14,"MAISONS MESNIL CERAMM 1","CERAMM1","Nicolas SCHMITT-Gloria VENDRELL-Christine MARIE LAVAUD-Amaury DE LA LAURENCIE-Amina ELABBADI",{"$f":"VLOOKUP(A18,Equipes!A:J,2,FALSE)","v":"M"},{"$f":"ROUND(VLOOKUP(A18,Equipes!$A$2:$J$41,10,0),0)","v":50},"",null,9,9]
[15,"SOISY SUR SEINE CN 1","CN1","Bertrand PIOGER-Bruno PERIQUOI-Servane BERTRAND-Alain BERNARD-Robert TRAUET",{"$f":"VLOOKUP(A19,Equipes!A:J,2,FALSE)","v":"H"},{"$f":"ROUND(VLOOKUP(A19,Equipes!$A$2:$J$41,10,0),0)","v":54},"",null,21,21]
[16,"PORT-MARLY RC 1","RCPM1","Jean-Claude LAFOREST-David CHARTIER-Christophe MARCAIS-Vincent BONTOUX-Alain ROUSSEAU",{"$f":"VLOOKUP(A20,Equipes!A:J,2,FALSE)","v":"H"},{"$f":"ROUND(VLOOKUP(A20,Equipes!$A$2:$J$41,10,0),0)","v":55},"",null,13,13]
[17,"ANDRESY CA CONFLUENT 1","CAC1","Daphne PARIZOT-Agnes BURGHGRAEVE SELLEN-Sylvie FRANSSEN-Severine LEGAILLARD-Martine LE ROUX",{"$f":"VLOOKUP(A21,Equipes!A:J,2,FALSE)","v":"F"},{"$f":"ROUND(VLOOKUP(A21,Equipes!$A$2:$J$41,10,0),0)","v":55},"",null,25,25]
[18,"MAISONS MESNIL CERAMM 2","CERAMM2","Claude LEMENAGER-Didier GIRARDEAU-Laurent LIBOTTE-Alain GIRARD-Cecile JEAMMES",{"$f":"VLOOKUP(A22,Equipes!A:J,2,FALSE)","v":"H"},{"$f":"ROUND(VLOOKUP(A22,Equipes!$A$2:$J$41,10,0),0)","v":58},"",null,29,29]
[19,"VILLENNES - POISSY AC 1","ACVP1","Olivier POLGE-Odile POLGE-Laurent BONHOMMET-Antoine VOLPI-Philippe STROHM",{"$f":"VLOOKUP(A23,Equipes!A:J,2,FALSE)","v":"H"},{"$f":"ROUND(VLOOKUP(A23,Equipes!$A$2:$J$41,10,0),0)","v":55},"",null,4,4]
[20,"ROUEN CNAR 1","CNAR1","Nathalie MOUSSET-Francois LAIR-Betty GESLAIN-Thierry DUCHESNE-Stephane MOUSSET",{"$f":"VLOOKUP(A24,Equipes!A:J,2,FALSE)","v":"M"},{"$f":"ROUND(VLOOKUP(A24,Equipes!$A$2:$J$41,10,0),0)","v":55},"",null,14,14]
[21,"PORT-MARLY RC 2","RCPM2","Guillaume CHARRON-Philippe VERHE-Stephan REYNIER-Dominique LEROUX-Luciano AUTUNNALE",{"$f":"VLOOKUP(A25,Equipes!A:J,2,FALSE)","v":"H"},{"$f":"ROUND(VLOOKUP(A25,Equipes!$A$2:$J$41,10,0),0)","v":51},"",null,22,22]
[22,"COUDRAY MONTCEAUX A 1","coudray1","Joseph RAYNAUD-Frederic MORAT-Benjamin HOUILLON-Pascal BEAUSSART-Anne HOUAL",{"$f":"VLOOKUP(A26,Equipes!A:J,2,FALSE)","v":"H"},{"$f":"ROUND(VLOOKUP(A26,Equipes!$A$2:$J$41,10,0),0)","v":52},"",null,33,33]
[23,"SN OISE 1","SN Oise 1\n","Agnes AUDEBERT-Nicolas RAUCH-Jerome ROUGE-Nathalie BAUDIER-Isabelle JOUBERT",{"$f":"VLOOKUP(A27,Equipes!A:J,2,FALSE)","v":"M"},{"$f":"ROUND(VLOOKUP(A27,Equipes!$A$2:$J$41,10,0),0)","v":50},"",null,3,3]
[24,"MEULAN LES MUREAUX AMMH 1","AMMH1","Xavier MARSAIS-Eric PRENEY-Yannick DAGMEY-David COINE-Arthur VAN SLOOTEN",{"$f":"VLOOKUP(A28,Equipes!A:J,2,FALSE)","v":"H"},{"$f":"ROUND(VLOOKUP(A28,Equipes!$A$2:$J$41,10,0),0)","v":53},"",null,26,26]
[25,"VILLENNES - POISSY AC 2","ACVP2","Franck CARIOU-Michael LE BANNER-Valerie DECAESTECKER-Karine GUILBON-Christophe ELINE",{"$f":"VLOOKUP(A29,Equipes!A:J,2,FALSE)","v":"M"},{"$f":"ROUND(VLOOKUP(A29,Equipes!$A$2:$J$41,10,0),0)","v":54},"",null,20,20]
[26,"EVRY SCA 1","SCA 1","Anne CARDUNER-Olivia PEZZOLI-Bruno CASIMIR-Lionel BOISSONNAT-Kristell MAUCHET",{"$f":"VLOOKUP(A30,Equipes!A:J,2,FALSE)","v":"M"},{"$f":"ROUND(VLOOKUP(A30,Equipes!$A$2:$J$41,10,0),0)","v":56},"",null,11,11]
[27,"MEULAN LES MUREAUX AMMH 1","AMMH1","Gwenaelle MARSAIS-Sophie SEFFAR-Catherine MARTINIER-Christelle GOANVIC-Marie LAMORE",{"$f":"VLOOKUP(A31,Equipes!A:J,2,FALSE)","v":"F"},{"$f":"ROUND(VLOOKUP(A31,Equipes!$A$2:$J$41,10,0),0)","v":47},""]
[28,"VILLENNES - POISSY AC 1","ACVP1","Frederic LE ROUX-Corinne HUARD-ROLLAND-Elodie DEREMIENCE-Marie-Claude LAUNAY-Olivier COSNEAU",{"$f":"VLOOKUP(A32,Equipes!A:J,2,FALSE)","v":"M"},{"$f":"ROUND(VLOOKUP(A32,Equipes!$A$2:$J$41,10,0),0)","v":53},""]
[29,"FONTAINEBLEAU APF 1","APF1","Kathleen SANCHEZ-Laurent FOUQUE-Christian MESSALES-Denis FLORY-David WEBER",{"$f":"VLOOKUP(A33,Equipes!A:J,2,FALSE)","v":"H"},{"$f":"ROUND(VLOOKUP(A33,Equipes!$A$2:$J$41,10,0),0)","v":57},""]
[30,"JOINVILLE AMJ 1","AMJ1","Vincent FABIEN-Arnaud PUPPO-Jonathan ROOKE-Xavier SUCHET-Nicolas JAMAULT",{"$f":"VLOOKUP(A34,Equipes!A:J,2,FALSE)","v":"H"},{"$f":"ROUND(VLOOKUP(A34,Equipes!$A$2:$J$41,10,0),0)","v":51},""]
[31,"NOGENT SUR MARNE CN 3","CN3","Alexandra COHEN SALMON-Isabelle MILON-BANNEROT-Jerome TROMBOFSKY-Olivier PASCAL-Elisabeth LAUNAY",{"$f":"VLOOKUP(A35,Equipes!A:J,2,FALSE)","v":"M"},{"$f":"ROUND(VLOOKUP(A35,Equipes!$A$2:$J$41,10,0),0)","v":53},""]
[32,"BOULOGNE 92 1","ACBB1","Isabelle MAIRE-Théo BEL BERBEL- LURBE-Thã‰Odore SEDAROS-Omar OUAZZANI-Alexandra MENEZES",{"$f":"VLOOKUP(A36,Equipes!A:J,2,FALSE)","v":"H"},{"$f":"ROUND(VLOOKUP(A36,Equipes!$A$2:$J$41,10,0),0)","v":43},"",null,27,27]
[33,"XX","XX","XX-XX-XX-XX-XX",{"$f":"VLOOKUP(A37,Equipes!A:J,2,FALSE)","v":"X"},{"$f":"ROUND(VLOOKUP(A37,Equipes!$A$2:$J$41,10,0),0)","v":0},"",null,15,15]
[34,"XX","XX","XX-XX-XX-XX-XX",{"$f":"VLOOKUP(A38,Equipes!A:J,2,FALSE)","v":"X"},{"$f":"ROUND(VLOOKUP(A38,Equipes!$A$2:$J$41,10,0),0)","v":0},"",null,12,12]
[35,"XX","XX","XX-XX-XX-XX-XX",{"$f":"VLOOKUP(A39,Equipes!A:J,2,FALSE)","v":"X"},{"$f":"ROUND(VLOOKUP(A39,Equipes!$A$2:$J$41,10,0),0)","v":0},"",null,28,28]
[36,"XX","XX","XX-XX-XX-XX-XX",{"$f":"VLOOKUP(A40,Equipes!A:J,2,FALSE)","v":"X"},{"$f":"ROUND(VLOOKUP(A40,Equipes!$A$2:$J$41,10,0),0)","v":0},"",null,28,28]
[37,"XX","XX","XX-XX-XX-XX-XX",{"$f":"VLOOKUP(A41,Equipes!A:J,2,FALSE)","v":"X"},{"$f":"ROUND(VLOOKUP(A41,Equipes!$A$2:$J$41,10,0),0)","v":0},""]
[38,"XX","XX","XX-XX-XX-XX-XX",{"$f":"VLOOKUP(A42,Equipes!A:J,2,FALSE)","v":"X"},{"$f":"ROUND(VLOOKUP(A42,Equipes!$A$2:$J$41,10,0),0)","v":0},""]
[39,"XX","XX","XX-XX-XX-XX-XX",{"$f":"VLOOKUP(A43,Equipes!A:J,2,FALSE)","v":"X"},{"$f":"ROUND(VLOOKUP(A43,Equipes!$A$2:$J$41,10,0),0)","v":0},""]
[40,"XX","XX","XX-XX-XX-XX-XX",{"$f":"VLOOKUP(A44,Equipes!A:J,2,FALSE)","v":"X"},{"$f":"ROUND(VLOOKUP(A44,Equipes!$A$2:$J$41,10,0),0)","v":0},""]

{"sheet":"Recompenses","index":24,"n_rows":60,"n_cols":6,"rows_kept":60,"cut":false,"hidden":false,"merged":[]}
["1er Equipage  féminin",null,null,null,"Temps","Equipage"]
[null,{"$f":"VLOOKUP(\"F1\",'Cl Catégories'!A:K,2,FALSE)","v":27},{"$f":"+VLOOKUP($B2,Equipes!$A$2:$I$41,3)","v":"MEULAN LES MUREAUX AMMH 1"},{"$f":"+VLOOKUP($B2,Equipes!$A$2:$I$41,4)","v":"AMMH1"},{"$f":"VLOOKUP(B2,'CL GENERAL'!A:K,7,FALSE)","v":"01:59:47"},{"$f":"+VLOOKUP($B$2,Equipes!$A$2:$I$41,5)","v":"Gwenaelle MARSAIS"}]
[null,null,null,null,null,{"$f":"+VLOOKUP($B$2,Equipes!$A$2:$I$41,6)","v":"Sophie SEFFAR"}]
[null,"1 Coupe",null,null,null,{"$f":"+VLOOKUP($B$2,Equipes!$A$2:$I$41,7)","v":"Catherine MARTINIER"}]
[null,"5 Médailles",null,null,null,{"$f":"+VLOOKUP($B$2,Equipes!$A$2:$I$41,8)","v":"Christelle GOANVIC"}]
[null,"5 Bouquets Fleurs",null,null,null,{"$f":"+VLOOKUP($B$2,Equipes!$A$2:$I$41,9)","v":"Marie LAMORE"}]
[]
["2ème",{"$f":"VLOOKUP(\"F2\",'Cl Catégories'!A:K,2,FALSE)","v":17},{"$f":"VLOOKUP(\"F2\",'Cl Catégories'!A:K,3,FALSE)","v":"ANDRESY CA CONFLUENT 1"},{"$f":"+VLOOKUP($B8,Equipes!$A$2:$I$41,4)","v":"CAC1"},{"$f":"VLOOKUP(B8,'CL GENERAL'!A:K,7,FALSE)","v":"02:01:10"},{"$f":"+VLOOKUP(B8,Equipes!$A$2:$I$41,5)","v":"Daphne PARIZOT"}]
["3ème",{"$f":"VLOOKUP(\"F3\",'Cl Catégories'!A:K,2,FALSE)","v":{"$error":"#N/A"}},{"$f":"VLOOKUP(\"F3\",'Cl Catégories'!A:K,3,FALSE)","v":{"$error":"#N/A"}},{"$f":"+VLOOKUP($B9,Equipes!$A$2:$I$41,4)","v":{"$error":"#N/A"}},{"$f":"VLOOKUP(B9,'CL GENERAL'!A:K,7,FALSE)","v":{"$error":"#N/A"}},{"$f":"+VLOOKUP(B9,Equipes!$A$2:$I$41,5)","v":{"$error":"#N/A"}}]
[]
["1er Equipage mixte",null,null,null,"Temps","Equipage"]
[null,{"$f":"VLOOKUP(\"M1\",'Cl Catégories'!A:K,2,FALSE)","v":28},{"$f":"+VLOOKUP($B12,Equipes!$A$2:$I$41,3)","v":"VILLENNES - POISSY AC 1"},{"$f":"+VLOOKUP($B12,Equipes!$A$2:$I$41,4)","v":"ACVP1"},{"$f":"VLOOKUP(B12,'CL GENERAL'!A:K,7,FALSE)","v":"01:31:07"},{"$f":"+VLOOKUP($B$12,Equipes!$A$2:$I$41,5)","v":"Frederic LE ROUX"}]
[null,null,null,null,null,{"$f":"+VLOOKUP($B$12,Equipes!$A$2:$I$41,6)","v":"Corinne HUARD-ROLLAND"}]
[null,null,null,null,null,{"$f":"+VLOOKUP($B$12,Equipes!$A$2:$I$41,7)","v":"Elodie DEREMIENCE"}]
[null,"1 Coupe ",null,null,null,{"$f":"+VLOOKUP($B$12,Equipes!$A$2:$I$41,8)","v":"Marie-Claude LAUNAY"}]
[null,"5 Médailles",null,null,null,{"$f":"+VLOOKUP($B$12,Equipes!$A$2:$I$41,9)","v":"Olivier COSNEAU"}]
[]
["2ème",{"$f":"VLOOKUP(\"M2\",'Cl Catégories'!A:K,2,FALSE)","v":8},{"$f":"+VLOOKUP($B18,Equipes!$A$2:$I$41,3)","v":"JOINVILLE AMJ 1"},{"$f":"+VLOOKUP($B18,Equipes!$A$2:$I$41,4)","v":"Joinville"},{"$f":"VLOOKUP(B18,'CL GENERAL'!A:K,7,FALSE)","v":"01:33:32"},{"$f":"+VLOOKUP(B18,Equipes!$A$2:$I$41,5)","v":"Laurent BAUDOIN"}]
["3ème",{"$f":"VLOOKUP(\"M3\",'Cl Catégories'!A:K,2,FALSE)","v":12},{"$f":"+VLOOKUP($B19,Equipes!$A$2:$I$41,3)","v":"EVRY SCA 2"},{"$f":"+VLOOKUP($B19,Equipes!$A$2:$I$41,4)","v":"SCA2"},{"$f":"VLOOKUP(B19,'CL GENERAL'!A:K,7,FALSE)","v":"01:36:53"},{"$f":"+VLOOKUP(B19,Equipes!$A$2:$I$41,5)","v":"Laurent YEBOAH"}]
[]
["1er Slalom",null,null,null,"Temps","Equipage"]
[null,null,{"$f":"+VLOOKUP($B22,Equipes!$A$2:$I$41,3)","v":{"$error":"#N/A"}},{"$f":"+VLOOKUP($B22,Equipes!$A$2:$I$41,4)","v":{"$error":"#N/A"}},{"$f":"VLOOKUP(B22,'CL GENERAL'!A:K,7,FALSE)","v":{"$error":"#N/A"}},{"$f":"+VLOOKUP($B$22,Equipes!$A$2:$I$41,5)","v":{"$error":"#N/A"}}]
[null,null,null,null,null,{"$f":"+VLOOKUP($B$22,Equipes!$A$2:$I$41,6)","v":{"$error":"#N/A"}}]
[null,"1 Coupe Poissy",null,null,null,{"$f":"+VLOOKUP($B$22,Equipes!$A$2:$I$41,7)","v":{"$error":"#N/A"}}]
[null,"5 Médailles",null," ",null,{"$f":"+VLOOKUP($B$22,Equipes!$A$2:$I$41,8)","v":{"$error":"#N/A"}}]
[null,null,null," ",null,{"$f":"+VLOOKUP($B$22,Equipes!$A$2:$I$41,9)","v":{"$error":"#N/A"}}]
[null,null," "]
["Prix de la Perséverance",null,null,null,null,"Equipage"]
[null,null,{"$f":"+VLOOKUP($B29,Equipes!$A$2:$I$41,3)","v":{"$error":"#N/A"}},{"$f":"+VLOOKUP($B29,Equipes!$A$2:$I$41,4)","v":{"$error":"#N/A"}},{"$f":"VLOOKUP(B29,'CL GENERAL'!A:K,7,FALSE)","v":{"$error":"#N/A"}},{"$f":"+VLOOKUP($B$29,Equipes!$A$2:$I$41,5)","v":{"$error":"#N/A"}}]
[null,null,null,null,null,{"$f":"+VLOOKUP($B$29,Equipes!$A$2:$I$41,6)","v":{"$error":"#N/A"}}]
[null,"1 Coupe G8 ",null,null,null,{"$f":"+VLOOKUP($B$29,Equipes!$A$2:$I$41,7)","v":{"$error":"#N/A"}}]
[null,"5 Médailles",null,null,null,{"$f":"+VLOOKUP($B$29,Equipes!$A$2:$I$41,8)","v":{"$error":"#N/A"}}]
[null,null," ",null,null,{"$f":"+VLOOKUP($B$29,Equipes!$A$2:$I$41,9)","v":{"$error":"#N/A"}}]
[]
["Prix de la 1er participation du club ",null,null,null,null,"Equipage"]
[null,null,null,null,"Temps"]
[null,"5 T-Shirt Conseil General"]
[null,"1 sac de sport"]
[]
[]
["3 Eme"," ",null,null,"Temps","Equipage"]
[null,{"$f":"'CL GENERAL'!A7","v":21},{"$f":"+VLOOKUP($B42,Equipes!$A$2:$I$41,3)","v":"PORT-MARLY RC 2"},{"$f":"+VLOOKUP($B42,Equipes!$A$2:$I$41,4)","v":"RCPM2"},{"$f":"VLOOKUP(B42,'CL GENERAL'!A:K,7,FALSE)","v":"01:31:40"},{"$f":"+VLOOKUP($B$42,Equipes!$A$2:$I$41,5)","v":"Guillaume CHARRON"}]
[null,null,null,null,null,{"$f":"+VLOOKUP($B$42,Equipes!$A$2:$I$41,6)","v":"Philippe VERHE"}]
[null,"1 Coupe G8",null,null,null,{"$f":"+VLOOKUP($B$42,Equipes!$A$2:$I$41,7)","v":"Stephan REYNIER"}]
[null,"5 Médailles",null,null,null,{"$f":"+VLOOKUP($B$42,Equipes!$A$2:$I$41,8)","v":"Dominique LEROUX"}]
[null,null,null,null,null,{"$f":"+VLOOKUP($B$42,Equipes!$A$2:$I$41,9)","v":"Luciano AUTUNNALE"}]
[]
["2éme"," ",null,null,null,"Equipage"]
[" ",{"$f":"'CL GENERAL'!A6","v":28},{"$f":"+VLOOKUP($B49,Equipes!$A$2:$I$41,3)","v":"VILLENNES - POISSY AC 1"},{"$f":"+VLOOKUP($B49,Equipes!$A$2:$I$41,4)","v":"ACVP1"},{"$f":"VLOOKUP(B49,'CL GENERAL'!A:K,7,FALSE)","v":"01:31:07"},{"$f":"+VLOOKUP($B$49,Equipes!$A$2:$I$41,5)","v":"Frederic LE ROUX"}]
[null,null,null,null,null,{"$f":"+VLOOKUP($B$49,Equipes!$A$2:$I$41,6)","v":"Corinne HUARD-ROLLAND"}]
[null,"1 Coupe ",null,null,null,{"$f":"+VLOOKUP($B$49,Equipes!$A$2:$I$41,7)","v":"Elodie DEREMIENCE"}]
[null,"5 Médailles",null,null,null,{"$f":"+VLOOKUP($B$49,Equipes!$A$2:$I$41,8)","v":"Marie-Claude LAUNAY"}]
[null,null,null,null,null,{"$f":"+VLOOKUP($B$49,Equipes!$A$2:$I$41,9)","v":"Olivier COSNEAU"}]
[]
["Vainqueur",null,null,null,null,"Equipage"]
[null,{"$f":"'CL GENERAL'!A5","v":16},{"$f":"+VLOOKUP($B56,Equipes!$A$2:$I$41,3)","v":"PORT-MARLY RC 1"},{"$f":"+VLOOKUP($B56,Equipes!$A$2:$I$41,4)","v":"RCPM1"},{"$f":"VLOOKUP(B56,'CL GENERAL'!A:K,7,FALSE)","v":"01:30:25"},{"$f":"+VLOOKUP($B$56,Equipes!$A$2:$I$41,5)","v":"Jean-Claude LAFOREST"}]
[null,null,null,null,null,{"$f":"+VLOOKUP($B$56,Equipes!$A$2:$I$41,6)","v":"David CHARTIER"}]
[null,"1 Trophée \"Grand 8\"  ",null,null,null,{"$f":"+VLOOKUP($B$56,Equipes!$A$2:$I$41,7)","v":"Christophe MARCAIS"}]
[null,"1 Coupe ",null,null,null,{"$f":"+VLOOKUP($B$56,Equipes!$A$2:$I$41,8)","v":"Vincent BONTOUX"}]
[null,"5 Trophées Villennes",null,null,null,{"$f":"+VLOOKUP($B$56,Equipes!$A$2:$I$41,9)","v":"Alain ROUSSEAU"}]